{"text_format":"1","workbook":"xlsx","n_sheets":7,"sheets":["K3VLS","spec","translation","specifications","仕様書","ポンプ仕様","history"],"not_rendered":{"charts":0,"images":9,"macros":1,"external_links":1,"defined_names":49,"comments":1,"pivot_tables":0},"unopened":[],"bounds":{"document_bytes":16777216,"sheet_cells":100000,"rows_first":2000,"rows_last":500,"rows_between":2000,"halvings":0,"cell_chars":16384,"cell_head_chars":4096},"cells_cut":0,"cells_raw":0,"read":"whole","date_system":"1900"}

{"sheet":"K3VLS","index":0,"n_rows":58,"n_cols":51,"rows_kept":58,"cut":false,"hidden":false,"merged":[[43,1,43,12],[43,13,43,24],[44,1,76,12],[44,13,76,24],[38,19,38,24],[41,1,41,5],[41,7,41,18],[41,19,41,24],[40,23,40,24],[30,7,31,12],[25,1,25,5],[32,13,32,18],[33,13,33,18],[34,13,34,18],[35,7,35,18],[36,7,36,18],[3,1,4,10],[5,1,7,10],[8,1,10,10],[3,11,4,13],[6,11,7,13],[9,11,10,13],[3,14,4,17],[6,14,7,17],[9,14,10,17],[11,1,11,8],[13,4,14,4],[16,1,16,5],[17,1,22,5],[26,1,27,5],[28,1,29,5],[17,6,22,6],[13,3,14,3],[44,27,53,31],[54,27,57,31],[26,27,30,31],[31,27,33,31],[37,7,37,18],[38,7,38,18],[39,7,39,18],[40,7,40,18],[40,1,40,5],[26,6,27,6],[28,6,29,6],[30,6,31,6],[30,1,31,5],[32,1,32,5],[33,1,33,5],[34,1,34,5],[35,1,35,5],[36,1,36,5],[37,1,37,5],[38,1,38,5],[39,1,39,5],[34,7,34,12],[26,13,27,18],[28,7,29,12],[28,19,29,19],[28,20,29,20],[26,20,27,20],[13,7,14,7],[13,8,14,8],[13,9,14,9],[13,10,14,10],[18,8,18,10],[19,8,19,10],[26,7,27,12],[22,8,22,10],[13,6,14,6],[12,1,14,2],[13,5,14,5],[24,7,24,12],[1,27,1,31],[2,27,3,31],[4,27,4,31],[5,27,12,31],[13,27,14,31],[15,27,22,31],[23,27,25,31],[23,1,23,5],[24,1,24,5],[16,7,16,18],[25,13,25,18],[1,6,2,9],[23,7,23,17],[17,47,17,48],[16,47,16,48],[23,33,23,38],[30,13,31,18],[30,24,31,24],[30,19,31,19],[1,21,1,23],[23,20,23,23],[3,21,4,24],[6,21,7,24],[9,21,10,24],[3,18,4,20],[6,18,7,20],[28,13,29,18],[28,21,29,21],[28,22,29,22],[1,33,1,44],[26,21,27,21],[24,13,24,18],[13,13,14,13],[13,14,14,14],[13,15,14,15],[13,16,14,16],[26,22,27,22],[23,39,23,44],[26,33,26,38],[49,46,49,47],[48,46,48,47],[26,39,26,44],[45,48,45,49],[23,46,25,50],[26,46,30,50],[31,46,33,50],[34,46,43,50],[13,46,14,50],[15,46,15,50],[18,46,22,50],[54,32,57,32],[44,45,53,45],[54,45,57,45],[2,45,3,45],[5,45,12,45],[45,46,45,47],[47,46,47,47],[46,46,46,50],[51,46,53,50],[2,32,3,32],[5,32,12,32],[13,32,14,32],[15,32,22,32],[23,32,25,32],[26,32,30,32],[50,46,50,47],[50,48,50,49],[44,46,44,50],[16,49,16,50],[17,49,17,50],[47,48,47,49],[54,46,57,50],[32,7,32,12],[30,20,31,20],[28,24,29,24],[42,1,42,12],[42,13,42,24],[33,7,33,12],[35,19,35,24],[30,21,31,21],[30,22,31,22],[30,23,31,23],[26,45,30,45],[31,45,33,45],[34,45,43,45],[39,23,39,24],[36,19,36,24],[34,19,34,21],[37,19,37,24],[34,22,34,23],[44,32,53,32],[34,27,43,31],[48,48,48,49],[49,48,49,49],[26,24,27,24],[13,45,14,45],[15,45,22,45],[23,45,25,45],[1,46,1,50],[31,32,33,32],[34,32,43,32],[26,19,27,19],[13,11,14,11],[13,12,14,12],[25,7,25,12],[9,18,10,20],[17,20,22,24],[16,20,16,24],[17,11,17,12],[17,13,17,14],[20,8,20,10],[21,8,21,10],[17,19,22,19],[17,15,17,16],[17,17,17,18],[17,8,17,10],[2,46,3,50],[4,46,4,50],[5,46,12,50]]}
[]
[null,null,null,null,null,null,{"$f":"IF(AND(U24<>\"\",U25<>\"\",U26<>\"\",U27<>\"\",U29<>\"\",U33<>\"\",X33<>\"\",X25<>\"\",X26<>\"\",X27<>\"\",X28<>\"\",X29<>\"\",X30<>\"\",T37<>\"\",X39<>\"\",X40<>\"\",U39<>\"\",U40<>\"\"),\"\",translation!E14)","v":"全ての必須項目に入力がされていません。"},null,null,null,null,null,null,null,null,null,null,null,null,null,null,"言語 : 日本語",null,null,"Rev: 15",null,null,{"$f":"translation!E79","v":"項目"},null,null,null,null,{"$f":"translation!E80","v":"No."},{"$f":"translation!E81","v":"標準仕様"},null,null,null,null,null,null,null,null,null,null,null,{"$f":"translation!E82","v":"コード"},{"$f":"translation!E83","v":"備考"}]
[null,null,null,null,null,null,null,null,null,null,null,null,null,null,null,null,null,null,null,null,null,null,null,null,null,null,null,{"$f":"translation!E85","v":"Oリングの素材"},null,null,null,null,3,"- ",{"$f":"translation!E102","v":" 鉱物油 (Oリング: ニトリルゴム、 オイルシール: フッ素ゴム)"},null,null,null,null,null,null,null,null,null,{"$f":"IF(spec!I45=\"★\",\"★\",IF(spec!I45=\"▲\",\"▲\",IF(spec!I45=\"◆\",\"◆\",\"\")))","v":""},"-"]
[null,{"$f":"translation!E3","v":"K3VLS シリーズ 引合仕様書"},null,null,null,null,null,null,null,null,null,{"$f":"translation!E6","v":"記入日 ："},null,null,null,null,null,null,{"$f":"translation!E7","v":"作成者 ："},null,null,null,null,null,null,null,null,null,null,null,null,null,null,"V ",{"$f":"translation!E103","v":" 全てバイトン (Oリング: フッ素ゴム、 オイルシール: フッ素ゴム)"},null,null,null,null,null,null,null,null,null,{"$f":"IF(spec!I46=\"★\",\"★\",IF(spec!I46=\"▲\",\"▲\",IF(spec!I46=\"◆\",\"◆\",\"\")))","v":""}]
[null,null,null,null,null,null,null,null,null,null,null,null,null,null,null,null,null,null,null,null,null,null,null,null,null,null,null,{"$f":"translation!E86","v":"シリーズの仕様"},null,null,null,null,4,"1 ",{"$f":"translation!E104","v":" 標準"},null,null,null,null,null,null,null,null,null,{"$f":"IF(spec!I47=\"★\",\"★\",IF(spec!I47=\"▲\",\"▲\",IF(spec!I47=\"◆\",\"◆\",\"\")))","v":""},{"$f":"spec!B47","v":1}]
[null,{"$f":"translation!E4","v":"赤枠のセルのドロップダウンリストからアイテムを選択してください。★付きのオプションは当社へ連絡ください、◆付きのオプションはヨーロッパまたはアメリカでのみ利用可能です。"},null,null,null,null,null,null,null,null,null,null,null,null,null,null,null,null,null,null,null,null,null,null,null,null,null,{"$f":"translation!E87","v":"スルードライブとポート位置"},null,null,null,null,5," 0 ",{"$f":"translation!E105","v":" スルードライブ無、サイドポート"},null,null,null,null,null,null,null,null,null,{"$f":"IF(spec!I48=\"★\",\"★\",IF(spec!I48=\"▲\",\"▲\",IF(spec!I48=\"◆\",\"◆\",\"\")))","v":""},0]
[null,null,null,null,null,null,null,null,null,null,null,{"$f":"translation!E8","v":"用途 ："},null,null,null,null,null,null,{"$f":"translation!E9","v":"実機型式 ："},null,null,null,null,null,null,null,null,null,null,null,null,null,null,"A ",{"$f":"translation!E106","v":" SAE-A 2 ボルト取付、サイドポート"},null,null,null,null,null,null,null,null,null,{"$f":"IF(spec!I49=\"★\",\"★\",IF(spec!I49=\"▲\",\"▲\",IF(spec!I49=\"◆\",\"◆\",\"\")))","v":""}]
[null,null,null,null,null,null,null,null,null,null,null,null,null,null,null,null,null,null,null,null,null,null,null,null,null,null,null,null,null,null,null,null,null,"B ",{"$f":"translation!E107","v":" SAE-B 2 ボルト取付、サイドポート"},null,null,null,null,null,null,null,null,null,{"$f":"IF(spec!I50=\"★\",\"★\",IF(spec!I50=\"▲\",\"▲\",IF(spec!I50=\"◆\",\"◆\",\"\")))","v":""}]
[null,{"$f":"translation!E5","v":"セルの色が赤の場合､当社標準仕様範囲外となります｡ 当社仕様範囲外の場合でも､備考に詳細を記載頂き､当社までご相談ください｡"},null,null,null,null,null,null,null,null,null,null,null,null,null,null,null,null,null,null,null,null,null,null,null,null,null,null,null,null,null,null,null,"BB ",{"$f":"translation!E108","v":" SAE-BB 2 ボルト取付、サイドポート"},null,null,null,null,null,null,null,null,null,{"$f":"IF(spec!I51=\"★\",\"★\",IF(spec!I51=\"▲\",\"▲\",IF(spec!I51=\"◆\",\"◆\",\"\")))","v":""}]
[null,null,null,null,null,null,null,null,null,null,null,{"$f":"translation!E10","v":"顧客 ："},null,null,null,null,null,null,{"$f":"translation!E11","v":"ポンプ型式 ："},null,null,{"$f":"D14&E14&F14&G14&H14&I14&J14&K14&L14&M14&N14&O14&P14&Q14","v":"K3VLS85-10RCS-L1A"},null,null,null,null,null,null,null,null,null,null,null,"C ",{"$f":"translation!E109","v":" SAE-C 2 / 4 ボルト取付、サイドポート "},null,null,null,null,null,null,null,null,null,{"$f":"IF(spec!I52=\"★\",\"★\",IF(spec!I52=\"▲\",\"▲\",IF(spec!I52=\"◆\",\"◆\",\"\")))","v":""}]
{"$rows_left_out":49}
{"sheet":"spec","index":1,"n_rows":156,"n_cols":11,"rows_kept":156,"cut":false,"hidden":true,"merged":[[129,0,133,0],[149,0,150,0],[151,0,152,0],[105,2,108,2],[109,2,112,2],[113,2,116,2],[117,2,120,2],[124,0,128,0],[134,0,139,0],[140,0,147,0]]}
[]
["2. Pump Size",null,null,50,65,85,105,150,{"$f":"K3VLS!T18","v":85}]
["Basic specifications","Pump Displacement Range",null," 50, 45, 40, 35 cm3"," 65, 60, 55 cm3"," 85, 80, 75, 70 cm3"," 105, 100, 95, 90 cm3"," 150, 145, 140, 130, 125 cm3",{"$f":"HLOOKUP($I$2,TABA[],ROW(I2),FALSE)","v":" 85, 80, 75, 70 cm3"}]
[null,1,null,50,65,85,105,150,{"$f":"HLOOKUP($I$2,TABA[],ROW(I3),FALSE)","v":85}]
[null,2,null,45,60,80,100,145,{"$f":"HLOOKUP($I$2,TABA[],ROW(I4),FALSE)","v":80}]
[null,3,null,40,55,75,95,140,{"$f":"HLOOKUP($I$2,TABA[],ROW(I5),FALSE)","v":75}]
[null,4,null,35,"-",70,90,130,{"$f":"HLOOKUP($I$2,TABA[],ROW(I6),FALSE)","v":70}]
[]
[null,5,null,"-","-","-","-",125,{"$f":"HLOOKUP($I$2,TABA[],ROW(I7),FALSE)","v":0}]
[null,"Max Speed",null,3250,3000,3000,2640,2400,{"$f":"HLOOKUP($I$2,TABA[],ROW(I9),FALSE)","v":3000}]
{"$rows_left_out":147}
{"sheet":"translation","index":2,"n_rows":182,"n_cols":5,"rows_kept":182,"cut":false,"hidden":true,"merged":[]}
[null,"列1","列2","列3"]
[null,"言語 : 日本語","Language : English","語言 : 中文"]
[null,"K3VLS シリーズ 引合仕様書","K3VLS series Inquiry Form","K3VLS 系列 询价规格书",{"$f":"HLOOKUP(K3VLS!$V$2,TAB[],ROW(E2),FALSE)","v":"K3VLS シリーズ 引合仕様書"}]
[null,"赤枠のセルのドロップダウンリストからアイテムを選択してください。★付きのオプションは当社へ連絡ください、◆付きのオプションはヨーロッパまたはアメリカでのみ利用可能です。","Please select an item from a drop down list in a cell with thick red borders. Options with ★ is that please contact Kawasaki, options with ◆ is available in Europe/US.","请从红框单元格的下拉列表中选择项目。带★的选项请联系Kawasaki, 带◆的选项仅在欧洲或美国可使用。",{"$f":"HLOOKUP(K3VLS!$V$2,TAB[],ROW(E3),FALSE)","v":"赤枠のセルのドロップダウンリストからアイテムを選択してください。★付きのオプションは当社へ連絡ください、◆付きのオプションはヨーロッパまたはアメリカでのみ利用可能です。"}]
[null,"セルの色が赤の場合､当社標準仕様範囲外となります｡ 当社仕様範囲外の場合でも､備考に詳細を記載頂き､当社までご相談ください｡","If the cell's color is red, the request is out of Kawasaki standard specifications range. Even if the request is out of Kawasaki specification range, please describe the detail on the note and consult with Kawasaki.","如单元格颜色为红色时, 则超出本公司标准规格范围。即使是本公司规格范围外的情况, 也请在评论中详细记载, 并与本公司协商。",{"$f":"HLOOKUP(K3VLS!$V$2,TAB[],ROW(E4),FALSE)","v":"セルの色が赤の場合､当社標準仕様範囲外となります｡ 当社仕様範囲外の場合でも､備考に詳細を記載頂き､当社までご相談ください｡"}]
[null,"記入日 ：","Fill-in Date ：","填写日期 ：",{"$f":"HLOOKUP(K3VLS!$V$2,TAB[],ROW(E5),FALSE)","v":"記入日 ："}]
[null,"作成者 ：","Author ：","编制者 ：",{"$f":"HLOOKUP(K3VLS!$V$2,TAB[],ROW(E6),FALSE)","v":"作成者 ："}]
[null,"用途 ：","Application ：","用途 ：",{"$f":"HLOOKUP(K3VLS!$V$2,TAB[],ROW(E7),FALSE)","v":"用途 ："}]
[null,"実機型式 ：","Machine M/C ：","整机型号 ：",{"$f":"HLOOKUP(K3VLS!$V$2,TAB[],ROW(E8),FALSE)","v":"実機型式 ："}]
[null,"顧客 ：","Customer ：","客户 ：",{"$f":"HLOOKUP(K3VLS!$V$2,TAB[],ROW(E9),FALSE)","v":"顧客 ："}]
{"$rows_left_out":173}
{"sheet":"specifications","index":3,"n_rows":244,"n_cols":20,"rows_kept":244,"cut":false,"hidden":true,"merged":[[39,16,39,17]]}
[null,"列1","列2","列3",null,null,null,null,"Oリング","流量制御","差圧範囲","制御方式の追加","合計","Reg型式","Reg組図番","設定"]
[null,"言語 : 日本語","Language : English","語言 : 中文",null,null,null,null,{"$f":"IF(K3VLS!$AT$3=\"-\",1,\"\")","v":1},{"$f":"IF(K3VLS!$AT$27=\"L1\",1,\"\")","v":1},{"$f":"IF(K3VLS!$AT$32=\"A\",1,\"\")","v":1},{"$f":"IF(K3VLS!$AT$35=\"Blank\",1,\"\")","v":1},{"$f":"SUM(I2:L2)","v":4},"KR3CS-L1A","21290-3493","〇"]
[null,"１.  本　　　機　：","1.  OEM MACHINE MODEL ：",null,{"$f":"HLOOKUP(K3VLS!$V$2,TAB_2[],ROW(E2),FALSE)","v":"１.  本　　　機　："},null,null,null,{"$f":"IF(K3VLS!$AT$3=\"V\",1,\"\")","v":""},{"$f":"IF(K3VLS!$AT$27=\"L1\",1,\"\")","v":1},{"$f":"IF(K3VLS!$AT$32=\"A\",1,\"\")","v":1},{"$f":"IF(K3VLS!$AT$35=\"Blank\",1,\"\")","v":1},{"$f":"SUM(I3:L3)","v":3},"KR3CSVL1A-037","21290-3506A","〇"]
[null,"OEM MACHINE MODEL","",null,{"$f":"HLOOKUP(K3VLS!$V$2,TAB_2[],ROW(E3),FALSE)","v":"OEM MACHINE MODEL"},null,null,null,{"$f":"IF(K3VLS!$AT$3=\"-\",1,\"\")","v":1},{"$f":"IF(K3VLS!$AT$27=\"L1\",1,\"\")","v":1},{"$f":"IF(K3VLS!$AT$32=\"C\",1,\"\")","v":""},{"$f":"IF(K3VLS!$AT$35=\"Blank\",1,\"\")","v":1},{"$f":"SUM(I4:L4)","v":3},"KR3CS-L1C","21290-3755","〇"]
[null,"用  途 ：","USAGE ：",null,{"$f":"HLOOKUP(K3VLS!$V$2,TAB_2[],ROW(E4),FALSE)","v":"用  途 ："},null,null,null,{"$f":"IF(K3VLS!$AT$3=\"V\",1,\"\")","v":""},{"$f":"IF(K3VLS!$AT$27=\"L1\",1,\"\")","v":1},{"$f":"IF(K3VLS!$AT$32=\"C\",1,\"\")","v":""},{"$f":"IF(K3VLS!$AT$35=\"Blank\",1,\"\")","v":1},2,"KR3CSVL1C","-","×"]
[null,"USAGE","",null,{"$f":"HLOOKUP(K3VLS!$V$2,TAB_2[],ROW(E5),FALSE)","v":"USAGE"},null,null,null,{"$f":"IF(K3VLS!$AT$3=\"-\",1,\"\")","v":1},{"$f":"IF(K3VLS!$AT$27=\"L0\",1,\"\")","v":""},{"$f":"IF(K3VLS!$AT$32=\"A\",1,\"\")","v":1},{"$f":"IF(K3VLS!$AT$35=\"Blank\",1,\"\")","v":1},3,"KR3CS-L0A","21290-3491A","〇"]
[null,"２.  機 器 型 式：","2.  PUMP MODEL CODE　：",null,{"$f":"HLOOKUP(K3VLS!$V$2,TAB_2[],ROW(E6),FALSE)","v":"２.  機 器 型 式："},null,null,null,{"$f":"IF(K3VLS!$AT$3=\"V\",1,\"\")","v":""},{"$f":"IF(K3VLS!$AT$27=\"L0\",1,\"\")","v":""},{"$f":"IF(K3VLS!$AT$32=\"A\",1,\"\")","v":1},{"$f":"IF(K3VLS!$AT$35=\"Blank\",1,\"\")","v":1},2,"KR3CSVL0A","-","×"]
[null,"PUMP MODEL CODE","",null,{"$f":"HLOOKUP(K3VLS!$V$2,TAB_2[],ROW(E7),FALSE)","v":"PUMP MODEL CODE"},null,null,null,{"$f":"IF(K3VLS!$AT$3=\"V\",1,\"\")","v":""},{"$f":"IF(K3VLS!$AT$27=\"L0\",1,\"\")","v":""},null,{"$f":"IF(K3VLS!$AT$35=\"Blank\",1,\"\")","v":1},1,"KR3CSVL0C","21290-4416A","〇"]
[null,"３. ポンプ仕様","",null,{"$f":"HLOOKUP(K3VLS!$V$2,TAB_2[],ROW(E8),FALSE)","v":"３. ポンプ仕様"},null,null,null,1,{"$f":"IF(K3VLS!$AT$27=\"L1\",1,\"\")","v":1},{"$f":"IF(K3VLS!$AT$32=\"A\",1,\"\")","v":1},{"$f":"IF(K3VLS!AT35<>\"Blank\",1,\"\")","v":""},3,"KR3CSVL1AA","21290-3853A","〇"]
[null,"PUMP SPECIFICATIONS","3. PUMP SPECIFICATIONS",null,{"$f":"HLOOKUP(K3VLS!$V$2,TAB_2[],ROW(E9),FALSE)","v":"PUMP SPECIFICATIONS"},null,null,null,1,null,null,{"$f":"IF(K3VLS!AT36<>\"Blank\",1,\"\")","v":1},2,"KR3CSVL1CA","-","×"]
{"$rows_left_out":235}
{"sheet":"仕様書","index":4,"n_rows":235,"n_cols":158,"rows_kept":235,"cut":false,"hidden":true,"merged":[[112,118,130,128],[176,120,181,130],[184,120,189,130],[196,121,201,131],[5,157,6,209],[76,132,94,142],[77,73,86,79],[77,80,86,90],[220,122,225,132],[223,73,228,83],[210,122,215,132],[152,91,155,92],[152,93,162,106],[77,103,86,113],[66,80,76,90],[66,91,76,102],[66,103,76,113],[98,80,101,88],[53,118,63,128],[88,119,95,129],[38,103,47,113],[38,73,47,79],[199,73,202,79],[139,93,149,108],[229,99,232,107],[203,73,208,83],[107,73,114,78],[107,79,110,92],[107,93,113,102],[107,103,114,112],[134,63,141,89],[111,79,113,92],[192,62,194,63],[142,62,144,63],[200,85,210,113],[212,85,216,113],[217,85,227,113],[146,60,190,63],[165,91,168,92],[165,93,175,103],[209,73,212,80],[125,73,128,93],[139,91,142,92],[116,80,119,101],[120,80,123,101],[178,91,181,92],[178,93,192,113],[194,71,197,72],[87,103,96,113],[38,91,47,102],[87,58,96,72],[87,73,96,79],[87,80,96,90],[87,91,96,102],[98,73,105,79],[102,96,105,113],[38,80,47,90],[48,91,65,102],[48,103,56,113],[98,58,105,72],[98,89,101,98],[16,103,25,113],[26,58,37,72],[26,73,37,79],[26,80,37,90],[26,91,37,102],[26,103,37,113],[6,93,6,102],[9,93,9,102],[211,23,218,33],[213,73,218,83],[164,23,174,33],[150,17,153,45],[146,17,149,45],[112,23,120,33],[112,34,120,45],[112,46,130,56],[57,80,65,90],[57,103,65,113],[64,34,71,45],[64,46,71,56],[66,58,76,72],[66,73,76,79],[48,73,65,79],[48,80,56,90],[145,122,163,132],[227,34,234,45],[227,46,234,56],[203,46,226,56],[211,11,218,15],[186,1,202,15],[186,16,202,22],[186,23,202,33],[186,34,202,45],[186,46,202,56],[233,73,238,83],[203,1,234,10],[203,11,210,15],[203,16,234,22],[203,23,210,33],[203,34,226,45],[142,46,163,56],[233,102,237,111],[234,87,237,95],[219,73,222,80],[229,73,232,79],[229,84,232,89],[158,17,161,43],[164,16,174,22],[227,11,234,15],[227,23,234,33],[121,1,130,15],[121,16,130,22],[121,23,130,33],[121,34,130,45],[141,1,163,15],[219,11,226,15],[219,23,226,33],[112,1,120,15],[112,16,120,22],[142,17,145,45],[131,1,140,15],[131,16,140,22],[131,23,140,33],[131,34,140,45],[131,46,140,56],[164,1,174,15],[164,34,174,45],[164,46,185,56],[154,17,157,43],[175,1,185,15],[175,16,185,22],[175,23,185,33],[175,34,185,45],[96,1,103,15],[80,1,95,8],[80,9,87,15],[80,23,87,33],[64,16,95,22],[64,23,71,33],[57,66,65,72],[104,1,111,15],[88,9,95,15],[194,74,196,79],[116,73,123,79],[96,16,111,22],[96,23,103,33],[96,34,103,45],[96,46,103,56],[55,34,62,41],[57,42,60,44],[48,58,65,65],[104,23,111,33],[104,34,111,45],[72,34,79,45],[72,46,79,56],[48,66,56,72],[80,34,87,45],[80,46,87,56],[88,23,95,33],[88,34,95,45],[88,46,95,56],[77,58,86,72],[72,23,79,33],[104,46,111,56],[43,16,63,22],[43,23,52,33],[6,17,6,39],[16,1,32,15],[16,16,32,22],[16,23,32,33],[16,34,32,45],[16,46,32,56],[16,58,25,72],[16,73,25,79],[16,80,25,90],[6,60,6,70],[9,60,9,70],[12,60,12,70],[16,91,25,102],[53,23,63,33],[53,46,63,56],[64,9,71,15],[33,1,42,15],[33,16,42,22],[33,23,42,33],[33,34,42,45],[33,46,42,56],[64,1,79,8],[53,9,63,15],[38,58,47,72],[46,42,49,44],[77,91,86,102],[72,9,79,15],[43,1,63,8],[43,9,52,15],[43,46,52,56],[44,36,51,40]]}
[]
[null,null,null,null,null,null,null,null,null,null,null,null,null,null,null,null,null,null,null,null,null,null,null,null,null,null,null,null,null,null,null,null,null,null,null,null,null,null,null,null,null,null,null,null,null,null,null,null,null,null,null,null,null,null,null,null,null,null,null,null,null,null,null,null,null,null,null,null,null,null,null,null,null,null,null,null,null,null,null,null,null,null,null,null,null,null,null,null,null,null,null,null,null,null,null,null,null,null,null,null,null,null,null,null,null,null,null,null,null,null,null,null,null,null,null,null,null,"Revision  A×7　Change specification. Oct.07,2016   A.Somatomo",null,null,null,null,null,null,null,null,null,null,null,null,null,null,null,null,null,null,null,null,null,null,null,null,null,null,null,null,null,null,null,null,null,null,null,null,null,null,null,"A×4　ｻﾌﾞﾌﾟﾚｰﾄ(発錆対策)変更による型式変更　2018.4.20  中前、津田、平野、藤川"]
[null,{"$f":"specifications!E3","v":"１.  本　　　機　："},null,null,null,null,null,null,null,null,null,null,null,null,null,null,null,{"$f":"K3VLS!V7","v":0},null,null,null,null,null,null,null,null,null,null,null,null,null,null,null,null,null,null,null,null,null,null,null,null,{"$f":"specifications!E5","v":"用  途 ："},null,null,null,null,null,{"$f":"K3VLS!O7","v":0},null,null,null,null,null,null,null,null,null,null,null,null,null,null,null,null,null,null,null,null,null,null,null,null,null,null,null,null,null,null,null,null,null,null,null,null,null,null,null,null,null,null,null,null,null,null,null,null,null,null,null,null,null,null,null,null,null,null,null,null,null,null,null,null,null,null,null,null,"Revision  A×3　Change the model code. Oct.13,2016   A.Somatomo ,  H.Miura",null,null,null,null,null,null,null,null,null,null,null,null,null,null,null,null,null,null,null,null,null,null,null,null,null,null,null,null,null,null,null,null,null,null,null,null,null,null,null,"B×1　組立断面図 図番改正　2019.1.24  峯崎、上田、藤川"]
[null,null,{"$f":"specifications!E4","v":"OEM MACHINE MODEL"},null,null,null,null,null,null,null,null,null,null,null,null,null,null,null,null,null,null,null,null,null,null,null,null,null,null,null,null,null,null,null,null,null,null,null,null,null,null,null,{"$f":"specifications!E6","v":"USAGE"},null,null,null,null,null,null,null,null,null,null,null,null,null,null,null,null,null,null,null,null,null,null,null,null,null,null,null,null,null,null,null,null,null,null,null,null,null,null,null,null,null,null,null,null,null,null,null,null,null,null,null,null,null,null,null,null,null,null,null,null,null,null,null,null,null,null,null,null,null,null,null,null,null,null,"              B×1　Change the dwg. No. Feb.02,2017   A.Somatomo",null,null,null,null,null,null,null,null,null,null,null,null,null,null,null,null,null,null,null,null,null,null,null,null,null,null,null,null,null,null,null,null,null,null,null,null,null,null,null,"C×4  型式変更　　　　2019.6.17  船本、上田、藤川"]
[null,null,null,null,null,null,null,null,null,null,null,null,null,null,null,null,null,null,null,null,null,null,null,null,null,null,null,null,null,null,null,null,null,null,null,null,null,null,null,null,null,null,null,null,null,null,null,null,null,null,null,null,null,null,null,null,null,null,null,null,null,null,null,null,null,null,null,null,null,null,null,null,null,null,null,null,null,null,null,null,null,null,null,null,null,null,null,null,null,null,null,null,null,null,null,null,null,null,null,null,null,null,null,null,null,null,null,null,null,null,null,null,null,null,null,null,null,"Revision  A×2　Addition of DWG No. Mar.17.2017   A.Somatomo",null,null,null,null,null,null,null,null,null,null,null,null,null,null,null,null,null,null,null,null,null,null,null,null,null,null,null,null,null,null,null,null,null,null,null,null,null,null,null,"D×1  ｽﾙｰﾄﾞﾗｲﾌﾞ部のﾏｽｷﾝｸﾞ範囲の変更　2020.3.19  海嶋、上田、藤川"]
[null,null,null,null,null,null,null,null,null,null,null,null,null,null,null,null,null,null,null,null,null,null,null,null,null,null,null,null,null,null,null,null,null,null,null,null,null,null,null,null,null,null,null,null,null,null,null,null,null,null,null,null,null,null,null,null,null,null,null,null,null,null,null,null,null,null,null,null,null,null,null,null,null,null,null,null,null,null,null,null,null,null,null,null,null,null,null,null,null,null,null,null,null,null,null,null,null,null,null,null,null,null,null,null,null,null,null,null,null,null,null,null,null,null,null,null,null,null,null,null,null,null,null,null,null,null,null,null,null,null,null,null,null,null,null,null,null,null,null,null,null,null,null,null,null,null,null,null,null,null,null,null,null,null,null,null,null,"E×8  型式変更　2022.6.1  海嶋、"]
[null,{"$f":"specifications!E7","v":"２.  機 器 型 式："},null,null,null,null,null,null,null,null,null,null,null,null,null,null,null,{"$f":"CONCATENATE(K3VLS!D14,K3VLS!E14,K3VLS!F14,K3VLS!G14,K3VLS!H14,K3VLS!I14,K3VLS!J14,K3VLS!K14,K3VLS!L14,K3VLS!M14,K3VLS!N14,K3VLS!O14,K3VLS!P14,K3VLS!Q14,\"-T\")","v":"K3VLS85-10RCS-L1A-T"},null,null,null,null,null,null,null,null,null,null,null,null,null,null,null,null,null,null,null,null,null,null,{"$f":"specifications!E115","v":"                《 外形寸法図 図番　："},null,null,null,null,null,null,null,null,null,null,null,null,null,null,null,null,null,null,null,"02431-",null,null,null,null,null,null,null,null,null,null,"》",null,{"$f":"IF(K3VLS!AT27=\"PR2\",\n    specifications!E127,\n    IF(OR(K3VLS!AT35=\"A\",K3VLS!AT35=\"B\",K3VLS!AT35=\"C2\",K3VLS!AT35=\"C3\"),\n        specifications!E121,\n        IF(OR(K3VLS!AT35=\"E2\",K3VLS!AT35=\"E3\",K3VLS!AT35=\"F2\",K3VLS!AT35=\"F3\"),\n            specifications!E125,\n            \"\"\n        )\n    )\n)","v":""},null,null,null,null,null,null,null,null,null,null,null,null,null,null,null,null,null,null,null,{"$f":"_xlfn.TEXTJOIN(\", \", TRUE,\n    IF(specifications!M16=4, specifications!Q16, \"\"),\n    IF(specifications!M19:M38=3, specifications!O19:O38, \"\"),\n    IF(specifications!M41:M48=2, specifications!O41:O48, \"\")\n)","v":""},null,null,null,null,null,null,null,null,null,{"$f":"IF(BV7<>\"\", \"》\", \"\")","v":""},null,null,null,null,null,null,null,null,null,null,null,null,null,"Revision    A×1　Change the dwg No. Apr.03,2017 "]
[null,null,null,{"$f":"specifications!E8","v":"PUMP MODEL CODE"},null,null,null,null,null,null,null,null,null,null,null,null,null,null,null,null,null,null,null,null,null,null,null,null,null,null,null,null,null,null,null,null,null,null,null,null,null,null,null,null,null,null,{"$f":"specifications!E116","v":"  INSTALLATION DIM. DWG. NO."},null,null,null,null,null,null,null,null,null,null,null,null,null,null,null,null,null,null,null,null,null,null,null,null,null,null,null,null,null,null,null,{"$f":"IF(K3VLS!AT27=\"PR2\",\n    specifications!E128,\n    IF(OR(K3VLS!AT35=\"A\",K3VLS!AT35=\"B\",K3VLS!AT35=\"C2\",K3VLS!AT35=\"C3\"),\n        specifications!E122,\n        IF(OR(K3VLS!AT35=\"E2\",K3VLS!AT35=\"E3\",K3VLS!AT35=\"F2\",K3VLS!AT35=\"F3\"),\n            specifications!E126,\n            \"\"\n        )\n    )\n)","v":""}]
[]
[null,null,null,null,null,null,null,null,null,null,null,null,null,null,null,null,null,null,null,null,null,null,null,null,null,null,null,null,null,null,null,null,null,null,null,null,null,null,null,null,{"$f":"specifications!E117","v":"                《 組立断面図 図番　："},null,null,null,null,null,null,null,null,null,null,null,null,null,null,null,null,null,null,null,"02440-",null,null,null,null,null,null,null,null,null,null,"》",null,{"$f":"IF(OR(K3VLS!AT35=\"A\",K3VLS!AT35=\"B\",K3VLS!AT35=\"C2\",K3VLS!AT35=\"C3\",K3VLS!AT35=\"E2\",K3VLS!AT35=\"E3\",K3VLS!AT35=\"F2\",K3VLS!AT35=\"F3\"),\n    specifications!E123,\n    \"\"\n)","v":""},null,null,null,null,null,null,null,null,null,null,null,null,null,null,null,null,null,null,null,null,null,null,null,null,null,null,null,null,null,{"$f":"IF(BV10<>\"\", \"》\", \"\")","v":""}]
{"$rows_left_out":226}
{"sheet":"ポンプ仕様","index":5,"n_rows":21,"n_cols":2,"rows_kept":21,"cut":false,"hidden":true,"merged":[]}
[]
["Model",{"$f":"CONCATENATE(K3VLS!D14,K3VLS!E14,K3VLS!F14,K3VLS!G14,K3VLS!H14,K3VLS!I14,K3VLS!J14,K3VLS!K14,K3VLS!L14,K3VLS!M14,K3VLS!N14,K3VLS!O14,K3VLS!P14,K3VLS!Q14)","v":"K3VLS85-10RCS-L1A"}]
["Displacement [cm3]",{"$f":"K3VLS!U24","v":0}]
["Direction of Rotation",{"$f":"spec!J57","v":"Clockwise"}]
["Max Speed (intermittent) [rpm]",{"$f":"spec!I10","v":3000}]
["Self Prime Max Speed (continuous)　[rpm]",{"$f":"spec!I11","v":2500}]
["Peak Pressure [MPa]",{"$f":"spec!I12","v":35}]
["Rated Pressure [MPa]",{"$f":"spec!I13","v":28}]
["Control type",{"$f":"spec!K73","v":"Load Sense + Pressure Cut-Off (With LS Bleed Blocked)"}]
["Amount of Oil [L]",{"$f":"spec!I122","v":1.2}]
{"$rows_left_out":12}
{"sheet":"history","index":6,"n_rows":40,"n_cols":7,"rows_kept":40,"cut":false,"hidden":true,"merged":[]}
[null,"Rev","Date","Who","Request / Correction","Answer","Memo"]
[null,"rev.15","2024-10-29","小倉","「history」タブを追加"]
[null,"rev.15","2024-10-29","小倉","フランジ / 取付ねじ形状 (吸入、吐出)のMねじ仕様のコードをM⇒Hに変更した"]
[null,"rev.15","2025-10-29","小倉","ポンプ許容トルクにK3VLの値が入っていたので変更した"]
[null,"rev.15","2025-10-29","小倉","K3VLS50のBB、K3VLS65のCスプライン許容トルクに値が入っていなかったので追加した"]
[null,"rev.15","2025-10-29","小倉","駆動方法を追加した"]
[null,"rev.15","2025-11-07","小倉","文字が切れないようにセルの幅を調整した。"]
[null,"rev.15","2025-11-10","小倉","流量制御で\"P0\"を選択した際、設定差圧範囲の\"C\"を選択できないようにした。"]
[null,"rev.15","2025-12-26","小倉","自吸最高回転数（断続)、自吸最高回転数(連続)と表現を変えた、また、回転数記入欄を最高⇒定格とした。"]
[]
{"$rows_left_out":30}