{"text_format":"1","workbook":"xlsx","n_sheets":3,"sheets":["K3VLS","spec","translation"],"not_rendered":{"charts":0,"images":4,"macros":1,"external_links":0,"defined_names":35,"comments":0,"pivot_tables":0},"unopened":[],"bounds":{"document_bytes":16777216,"sheet_cells":100000,"rows_first":2000,"rows_last":500,"rows_between":2000,"halvings":0,"cell_chars":16384,"cell_head_chars":4096},"cells_cut":0,"cells_raw":0,"read":"whole","date_system":"1900"}

{"sheet":"K3VLS","index":0,"n_rows":101,"n_cols":23,"rows_kept":101,"cut":false,"hidden":false,"merged":[[45,4,53,4],[27,5,27,16],[56,1,63,3],[54,17,55,17],[45,1,53,3],[44,18,44,22],[52,5,52,15],[53,5,53,15],[75,5,75,15],[57,5,57,15],[58,5,58,15],[42,1,43,3],[42,4,43,4],[54,5,54,15],[73,18,75,22],[45,17,53,17],[49,5,49,15],[50,5,50,15],[45,5,45,15],[51,5,51,15],[43,5,43,15],[31,1,31,3],[46,5,46,15],[31,5,31,16],[26,5,26,16],[23,1,23,3],[23,5,23,10],[28,1,28,3],[28,5,28,16],[29,1,29,3],[27,17,27,22],[25,1,25,3],[25,5,25,10],[25,11,25,16],[25,17,25,19],[27,1,27,3],[29,21,29,22],[28,17,28,22],[31,17,31,22],[54,18,55,22],[45,18,53,22],[42,17,43,17],[42,18,43,22],[42,5,42,15],[39,5,39,15],[73,17,75,17],[91,18,91,22],[74,5,74,15],[76,18,87,22],[76,17,87,17],[90,5,90,15],[67,10,67,15],[68,10,68,15],[91,5,91,15],[69,10,69,15],[70,10,70,15],[68,5,68,9],[80,5,80,15],[81,5,81,15],[71,5,71,15],[72,5,72,15],[79,5,79,15],[56,18,63,22],[66,5,66,9],[60,5,60,15],[59,5,59,15],[64,10,64,15],[56,5,56,15],[65,10,65,15],[66,10,66,15],[64,18,66,22],[98,1,100,3],[98,4,100,4],[98,5,98,15],[99,5,99,15],[100,5,100,15],[64,17,66,17],[56,4,63,4],[61,5,61,15],[62,5,62,15],[63,5,63,15],[56,17,63,17],[85,5,85,15],[76,1,87,3],[76,4,87,4],[86,5,86,15],[82,5,82,15],[76,5,76,15],[67,1,72,3],[73,1,75,3],[73,4,75,4],[67,4,72,4],[88,1,97,3],[88,4,97,4],[69,5,69,9],[96,21,96,22],[97,21,97,22],[67,17,72,17],[67,18,72,22],[64,4,66,4],[64,5,64,9],[98,18,100,22],[96,5,96,15],[97,5,97,15],[98,17,100,17],[88,18,89,22],[92,5,92,15],[93,5,93,15],[94,5,94,15],[95,5,95,15],[90,18,90,22],[67,5,67,9],[84,5,84,15],[78,5,78,15],[73,5,73,15],[65,5,65,9],[88,17,97,17],[88,5,88,15],[89,5,89,15],[18,22,19,22],[20,1,21,3],[20,4,21,4],[20,5,21,10],[25,20,25,21],[18,4,19,4],[26,1,26,3],[15,5,15,16],[16,5,16,10],[16,11,16,16],[15,1,15,3],[16,1,16,3],[20,22,21,22],[23,11,23,16],[26,17,26,22],[22,5,22,10],[22,11,22,16],[15,18,15,21],[24,1,24,3],[18,19,19,19],[18,20,19,20],[20,11,21,16],[20,17,21,17],[20,18,21,18],[36,5,36,16],[36,18,36,22],[37,1,41,3],[37,4,41,4],[37,5,37,15],[37,17,41,17],[37,18,41,22],[38,5,38,15],[41,5,41,15],[40,5,40,15],[36,1,36,3],[2,19,2,22],[5,10,5,12],[5,13,5,16],[5,17,5,18],[8,19,8,22],[10,1,10,6],[2,1,2,5],[11,20,12,22],[12,10,12,11],[0,19,0,20],[44,1,44,3],[47,5,47,15],[17,1,17,3],[17,5,17,10],[18,1,19,3],[30,1,30,3],[22,1,22,3],[0,5,0,6],[24,5,24,10],[24,11,24,16],[34,1,34,11],[34,12,34,22],[33,1,33,11],[33,12,33,22],[29,5,29,16],[30,5,30,16],[30,21,30,22],[2,10,2,12],[2,13,2,16],[2,17,2,18],[5,1,6,8],[7,1,8,8],[11,1,12,1],[70,5,70,9],[87,5,87,15],[17,11,17,16],[5,19,5,22],[8,10,8,12],[8,13,8,16],[8,17,8,18],[64,1,66,3],[48,5,48,15],[83,5,83,15],[77,5,77,15],[55,5,55,15],[54,1,55,3],[54,4,55,4],[20,19,21,19],[20,20,21,20],[18,11,19,16],[18,17,19,17],[18,5,19,10],[18,18,19,18],[11,10,11,11],[14,1,14,3],[14,5,14,16],[14,17,14,22]]}
[null,null,null,null,null,null,null,null,null,null,null,null,null,null,null,null,null,null,null,"言語 : 日本語",null,null,"Rev: 13"]
[]
[null,{"$f":"translation!F3","v":"K3VLS シリーズ 引合仕様書"},null,null,null,null,null,null,null,null,{"$f":"translation!F6","v":"記入日 ："},null,null,null,null,null,null,{"$f":"translation!F7","v":"作成者 ："}]
[]
[]
[null,{"$f":"translation!F4","v":"赤枠のセルのドロップダウンリストからアイテムを選択してください。★付きのオプションはKawasakiへ連絡ください、◆付きのオプションはヨーロッパまたはアメリカでのみ利用可能です。"},null,null,null,null,null,null,null,null,{"$f":"translation!F8","v":"用途 ："},null,null,null,null,null,null,{"$f":"translation!F9","v":"実機型式 ："}]
[]
[null,{"$f":"translation!F5","v":"セルの色が赤の場合､当社標準仕様範囲外となります｡ 当社仕様範囲外の場合でも､注記に詳細を記載頂き､当社までご相談ください｡"}]
[null,null,null,null,null,null,null,null,null,null,{"$f":"translation!F10","v":"顧客 ："},null,null,null,null,null,null,{"$f":"translation!F11","v":"ポンプ型式 ："},null,{"$f":"C13&D13&E13&F13&G13&H13&I13&J13&K13&M13&N13&O13&P13&Q13&R13","v":"K3VLS50-10RBS-L0A-T***"}]
[]
[null,{"$f":"translation!F12","v":"斜板式アキシャルピストンポンプ"}]
[null,{"$f":"translation!F13","v":"注文コード"},1,2,3,4,5,6,7,8,null,null,9,10,11,12,null,13,null,null,{"$f":"IF(AND(S16<>\"\",S17<>\"\",S18<>\"\",S19<>\"\",S21<>\"\",S24<>\"\",V17<>\"\",V18<>\"\",V19<>\"\",V20<>\"\",V21<>\"\",V22<>\"\",R28<>\"\",V30<>\"\",V31<>\"\",S30<>\"\",S31<>\"\"),\"\",translation!F14)","v":"全ての必須項目に入力がされていません。"}]
[null,null,"K3VLS",{"$f":"IF(R38<>\"\",R38,\"\")","v":50},{"$f":"IF(R43<>\"\",R43,\"\")","v":"-"},1,{"$f":"IF(R46<>\"\",R46,\"\")","v":0},{"$f":"IF(R55<>\"\",R55,\"\")","v":"R"},{"$f":"IF(R57<>\"\",R57,\"\")","v":"B"},{"$f":"IF(R65<>\"\",R65,\"\")","v":"S"},"-",null,{"$f":"IF(R68<>\"\",R68,\"\")","v":"L0"},{"$f":"IF(R74=\"Blank\",\"\",R74)","v":"A"},{"$f":"IF(R77=\"Blank\",\"\",R77)","v":""},{"$f":"IF(R89=\"Blank\",\"\",R89)","v":""},"-",{"$f":"IF(R99=\"Blank\",\"\",R99)","v":"T***"}]
[]
[null,{"$f":"translation!F15","v":"項目"},null,null,{"$f":"translation!F31","v":"No."},{"$f":"translation!F32","v":"標準仕様"},null,null,null,null,null,null,null,null,null,null,null,{"$f":"translation!F53","v":"顧客仕様"}]
[null,{"$f":"translation!F16","v":"ポンプ最大押しのけ容積"},null,null,"---",{"$f":"translation!F33","v":"50, 45, 40, 35cm3"},null,null,null,null,null,null,null,null,null,null,null,{"$f":"translation!F54","v":"最大容積:"},null,null,null,null,"cm3"]
[null,{"$f":"translation!F17","v":"最高 / 自吸最高回転数"},null,null,"---",{"$f":"translation!F34","v":"最高回転数: 3250 min-1 まで"},null,null,null,null,null,{"$f":"translation!F45","v":"自吸最高回転数: 2700 min-1 @0cm3 まで"},null,null,null,null,null,{"$f":"translation!F55","v":"最高:"},null,"min-1",{"$f":"translation!F72","v":"自吸最高:"},null,"min-1"]
[null,{"$f":"translation!F18","v":"ピーク / 定格圧力"},null,null,"---",{"$f":"translation!F35","v":"ピーク圧力: 35 MPa まで"},null,null,null,null,null,{"$f":"translation!F46","v":"定格圧力: 28 MPa まで"},null,null,null,null,null,{"$f":"translation!F56","v":"ピーク:"},null,"MPa",{"$f":"translation!F73","v":"定格:"},null,"MPa"]
[null,{"$f":"translation!F19","v":"ロードセンシング差圧設定 / 公差"},null,null,"---",{"$f":"translation!F36","v":"ロードセンシング差圧設定: 1.5 MPa (標準)\n(コード A : 調整範囲 = 1.0 - 3.0 MPa)"},null,null,null,null,null,{"$f":"translation!F47","v":"公差: +0.3/-0.2 MPa (標準)"},null,null,null,null,null,{"$f":"translation!F57","v":"ΔLS:"},null,"MPa",{"$f":"translation!F74","v":"公差:"},null,"MPa"]
[]
[null,{"$f":"translation!F20","v":"カットオフ圧力設定 / 公差"},null,null,"---",{"$f":"translation!F37","v":"圧力カットオフ: 28 MPa (標準)\n(調整範囲 = 5.0 - 28.0 MPa)"},null,null,null,null,null,{"$f":"translation!F48","v":"公差: +0/-1.5 MPa (標準)"},null,null,null,null,null,{"$f":"translation!F58","v":"カットオフ:"},null,"MPa",{"$f":"translation!F75","v":"公差:"},null,"MPa"]
[]
[null,{"$f":"translation!F21","v":"吸入圧力 / 油温範囲"},null,null,"---",{"$f":"translation!F38","v":"吸入圧力は最大押しのけ容積で0MPa以上を保持してください。"},null,null,null,null,null,{"$f":"translation!F49","v":"-20 ～ 95 ℃"},null,null,null,null,null,{"$f":"translation!F59","v":"吸入圧力:"},null,"MPa",{"$f":"translation!F76","v":"作動油温:"},null,"℃"]
[null,{"$f":"translation!F22","v":"ポンプ / スルードライブ入力トルク"},null,null,"---",{"$f":"translation!F39","v":"ポンプ(スルードライブポンプを含む) トルク:  200 Nm まで"},null,null,null,null,null,{"$f":"translation!F50","v":"スルードライブポンプ:  - Nm まで"},null,null,null,null,null,{"$f":"translation!F60","v":"ポンプ:"},null,"Nm",{"$f":"translation!F77","v":"T/D:"},null,"Nm"]
[null,{"$f":"translation!F23","v":"許容ケーシング圧"},null,null,"---",{"$f":"translation!F40","v":"常用: 0.1 MPaまで"},null,null,null,null,null,{"$f":"translation!F51","v":"ピーク時: 0.4 MPaまで"},null,null,null,null,null,{"$f":"translation!F61","v":"常用:"},null,"MPa",{"$f":"translation!F78","v":"ピーク時:"},null,"MPa"]
[null,{"$f":"translation!F24","v":"油種 / 粘度の許容範囲"},null,null,"---",{"$f":"translation!F41","v":"ISO VG46相当"},null,null,null,null,null,{"$f":"translation!F52","v":"10 ～ 1,000 mm2/s(cSt)"},null,null,null,null,null,null,null,null,null,null,"mm2/s(cSt)"]
[null,{"$f":"translation!F25","v":"銘板"},null,null,"---",{"$f":"translation!F42","v":"KHI 標準 (サプライヤ名、型式コード、シリアルナンバー)"}]
[null,{"$f":"translation!F26","v":"塗装仕様"},null,null,"---",{"$f":"translation!F43","v":"KHI 標準 (赤茶色)"}]
[null,{"$f":"translation!F27","v":"顧客部品番号"},null,null,"---"]
[null,{"$f":"translation!F28","v":"試供要件"},null,null,"---",null,null,null,null,null,null,null,null,null,null,null,null,{"$f":"translation!F69","v":"数量:"},null,"pcs",{"$f":"translation!F79","v":"納期:"}]
[null,{"$f":"translation!F29","v":"量産スケジュール"},null,null,"---",null,null,null,null,null,null,null,null,null,null,null,null,{"$f":"translation!F70","v":"数量:"},null,{"$f":"translation!F71","v":"pcs/年"},{"$f":"translation!F80","v":"開始日:"}]
[null,{"$f":"translation!F30","v":"元ポンプ型式(競合)"},null,null,"---",{"$f":"translation!F44","v":"元ポンプ型式が分かる場合は、参考のために記入してください。"}]
[]
[null,{"$f":"translation!F81","v":"注記(その他ご要求仕様)"},null,null,null,null,null,null,null,null,null,null,{"$f":"translation!F82","v":"使用条件と負荷デューティー(詳細を記入してください)"}]
[]
[]
[null,{"$f":"translation!F83","v":"項目"},null,null,{"$f":"translation!F96","v":"No."},{"$f":"translation!F97","v":"標準仕様"},null,null,null,null,null,null,null,null,null,null,null,{"$f":"translation!F169","v":"コード"},{"$f":"translation!F172","v":"Note"}]
[null,{"$f":"translation!F84","v":"ポンプサイズ"},null,null,2,{"$f":"translation!F98","v":" 50"},null,null,null,null,null,null,null,null,null,null,null,50]
[null,null,null,null,null,{"$f":"translation!F99","v":" 65"}]
[null,null,null,null,null,{"$f":"translation!F100","v":" 85"}]
{"$rows_left_out":62}
{"sheet":"spec","index":1,"n_rows":155,"n_cols":33,"rows_kept":155,"cut":false,"hidden":true,"merged":[[68,2,68,8],[2,0,3,1],[51,0,52,1],[57,4,57,8],[58,4,58,8],[59,4,59,8],[60,4,60,8]]}
["1-1.　Pump Options"]
[]
["Model Code",null,"K3VLS",105,"-",1,"BB","R","CC","S","-","L1","A","A","M1"]
[null,null,1,2,3,4,5,6,7,8,null,9,10,11,12,null,null,null,null,null,null,null,null,null,null,null,null,null,null,null,null,{"$f":"translation!F62","v":"下塗り赤（KHI標準）"},{"$f":"translation!F62","v":"下塗り赤（KHI標準）"}]
[null,null,null,null,null,null,null,null,null,null,null,null,null,null,null,null,null,null,null,null,null,null,null,null,null,null,null,null,null,null,null,{"$f":"translation!F63","v":"ネオロングレイ"},{"$f":"translation!F63","v":"ネオロングレイ"}]
[1,null,"K3VLS Series Pump",null,null,null,null,null,null,null,null,null,null,null,null,null,null,null,null,null,null,null,null,null,null,null,null,null,null,null,null,{"$f":"translation!F64","v":"ネオロンレッド"},{"$f":"translation!F64","v":"ネオロンレッド"}]
[null,null,"K3VLS Series, Variable Displacement,　Axial Piston, Open Loop Pump",null,null,null,null,null,null,null,null,null,null,null,null,null,null,null,null,null,null,null,null,null,null,null,null,null,null,null,null,{"$f":"translation!F65","v":"イエロープライマー"},{"$f":"translation!F65","v":"イエロープライマー"}]
[null,null,null,null,null,null,null,null,null,null,null,null,null,null,null,null,null,null,null,null,null,null,null,null,null,null,null,null,null,null,null,{"$f":"translation!F66","v":"チャコールグレイ"},{"$f":"translation!F66","v":"チャコールグレイ"}]
[2,null,"Pump Size",null,null,null,null,null,null,50,65,85,105,150,null,null,null,null,null,null,null,null,null,null,null,null,null,null,null,null,null,{"$f":"translation!F67","v":"ベッカーズブラック(KPM(UK)製品のみ"},{"$f":"translation!F68","v":"顧客要求色"}]
[null,null,"Pump Size",null,null,null,null,null,null,"●","●","●","●","●",null,null,null,null,null,null,null,null,null,null,null,null,null,null,null,null,null,{"$f":"translation!F68","v":"顧客要求色"},{"$f":"translation!F67","v":"ベッカーズブラック(KPM(UK)製品のみ"}]
[]
[3,null,"O-ring Material (Oil seal in Viton only)"]
[null,null,"-","NBR O-ring seals"]
[null,null,"V","Viton O-ring seals",null,null,null,null,null,"●","●","●","●","●"]
[]
[4,null,"Series Type Code",null,null,null,null,null,null,null,null,null,null,null,null,null,null,"max dis","op1","op2","op3","op4","op5",null,"Rated sp","Max sp","Rated pres","Max pres","Capable speed"]
[null,null,1,"Standard Type",null,null,null,null,null,null,null,null,null,null,null,null,50,50,45,40,35,1,1,{"$f":"TEXT(R17,\"0\")&\", \"&TEXT(S17,\"0\")&\", \"&TEXT(T17,\"0\")&\", \"&TEXT(U17,\"0\")&\"cm3\"","v":"50, 45, 40, 35cm3"},2700,3250,28,35,{"$f":"Y17","v":2700}]
[null,null,null,null,null,null,null,null,null,null,null,null,null,null,null,null,65,65,60,55,1,1,1,{"$f":"TEXT(R18,\"0\")&\", \"&TEXT(S18,\"0\")&\", \"&TEXT(T18,\"0\")&\"cm3\"","v":"65, 60, 55cm3"},2600,3000,28,35,{"$f":"Y18","v":2600}]
[5,null,"Through Drive and Porting",null,null,null,null,null,null,50,65,85,105,150,null,null,85,85,80,75,70,1,1,{"$f":"TEXT(R19,\"0\")&\", \"&TEXT(S19,\"0\")&\", \"&TEXT(T19,\"0\")&\", \"&TEXT(U19,\"0\")&\"cm3\"","v":"85, 80, 75, 70cm3"},2500,3000,28,35,2500]
[null,null,0,"Without Through Drive, Side Ported",null,null,null,null,null,"●","●","●","●","●",null,null,105,105,100,95,90,1,1,{"$f":"TEXT(R20,\"0\")&\", \"&TEXT(S20,\"0\")&\", \"&TEXT(T20,\"0\")&\", \"&TEXT(U20,\"0\")&\"cm3\"","v":"105, 100, 95, 90cm3"},2300,2640,28,35,2300]
[null,null,"A","SAE-A Through Drive, Side Ported",null,null,null,null,null,"●","●","●","●","-",null,null,150,150,145,140,1,130,125,{"$f":"TEXT(R21,\"0\")&\", \"&TEXT(S21,\"0\")&\", \"&TEXT(T21,\"0\")&\", \"&TEXT(V21,\"0\")&\", \"&TEXT(W21,\"0\")&\" cm3\"","v":"150, 145, 140, 130, 125 cm3"},2200,2400,28,35,2200]
[null,null,"B","SAE-B Through Drive, Side Ported",null,null,null,null,null,"●","●","●","●","●",null,null,null,{"$f":"VLOOKUP(K3VLS!R38,Q17:R21,2,)","v":50},{"$f":"VLOOKUP(K3VLS!R38,Q17:S21,3,)","v":45},{"$f":"VLOOKUP(K3VLS!R38,Q17:T21,4,)","v":40},{"$f":"VLOOKUP(K3VLS!R38,Q17:U21,5,)","v":35},{"$f":"VLOOKUP(K3VLS!R38,Q17:V21,6,)","v":1},{"$f":"VLOOKUP(K3VLS!R38,Q17:W21,7,)","v":1},{"$f":"VLOOKUP(K3VLS!R38,Q17:X21,8,)","v":"50, 45, 40, 35cm3"},{"$f":"VLOOKUP(K3VLS!R38,Q17:Y21,9,)","v":2700},{"$f":"VLOOKUP(K3VLS!R38,Q17:Z21,10,)","v":3250},{"$f":"VLOOKUP(K3VLS!R38,Q17:AA21,11,)","v":28},{"$f":"VLOOKUP(K3VLS!R38,Q17:AB21,12,)","v":35},{"$f":"VLOOKUP(K3VLS!R38,Q17:AC21,13,)","v":2700}]
[null,null,"BB","SAE-BB Through Drive, Side Ported",null,null,null,null,null,"●","●","●","●","●"]
[null,null,"C","SAE-C, 2/4 bolt, Through Drive, Side Ported",null,null,null,null,null,"-","●","●","●","●"]
[null,null,"CC","SAE-CC, 2/4 bolt, Through Drive, Side Ported",null,null,null,null,null,"-","-","-","●","●"]
[null,null,"N","With Through Drive Shaft, Without Coupling,　Closed with Steel Cover, Side Ported",null,null,null,null,null,"●","●","●","●","●"]
[null,null,"R","Without Through Drive, Rear Ported",null,null,null,null,null,"●","●","●","○","○",null,null,50,"●",{"$f":"VLOOKUP(K3VLS!R38,Q27:R31,2,0)","v":"●"}]
[null,null,null,null,null,null,null,null,null,null,null,null,null,null,null,null,65,"●"]
[6,null,"Direction of Rotation",null,null,null,null,null,null,50,65,85,105,150,null,null,85,"●"]
[null,null,"R","Clockwise",null,null,null,null,null,"●","●","●","●","●",null,null,105,"●"]
[null,null,"L","Counterclockwise",null,null,null,null,null,"●","●","●","●","●",null,null,150,"●"]
[]
[7,null,"Mounting Flange and Shaft",null,null,null,null,null,null,50,65,85,105,150]
[null,null,"B","SAE-B Mount & SAE-B Spline",null,null,null,null,null,"●","●","-","-","-"]
[null,null,"BB","SAE-B Mount & SAE-BB Spline",null,null,null,null,null,"●","●","-","-","-"]
[null,null,"C","SAE-C Mount & SAE-C Spline",null,null,null,null,null,"-","●","●","●","●"]
[null,null,"CC","SAE-C Mount & SAE-CC Spline",null,null,null,null,null,"-","-","-","●","●"]
[null,null,"D","SAE-D Mount & SAE-D Spline",null,null,null,null,null,"-","-","-","-","●"]
[null,null,"K2","SAE-B Mount & SAE-BB Keyed Shaft",null,null,null,null,null,"◆","◆","-","-","-"]
[null,null,"K3","SAE-C Mount & SAE-C Keyed Shaft",null,null,null,null,null,"-","◆","◆","-","-"]
{"$rows_left_out":116}
{"sheet":"translation","index":2,"n_rows":173,"n_cols":6,"rows_kept":173,"cut":false,"hidden":true,"merged":[]}
[]
[null,1,"言語 : 日本語","Language : English","語言 : 中文"]
[null,2,"K3VLS シリーズ 引合仕様書","K3VLS series Inquiry Form","K3VLS 系列 询价规格书",{"$f":"HLOOKUP(K3VLS!T1,C2:E173,2,FALSE)","v":"K3VLS シリーズ 引合仕様書"}]
[null,3,"赤枠のセルのドロップダウンリストからアイテムを選択してください。★付きのオプションはKawasakiへ連絡ください、◆付きのオプションはヨーロッパまたはアメリカでのみ利用可能です。","Please select an item from a drop down list in a cell with thick red borders. Options with ★ is that please contact Kawasaki, options with ◆ is available in Europe/US.","请从红框单元格的下拉列表中选择项目。带★的选项请联系Kawasaki,带◆的选项仅在欧洲或美国可使用。",{"$f":"HLOOKUP(K3VLS!T1,C2:E173,3,FALSE)","v":"赤枠のセルのドロップダウンリストからアイテムを選択してください。★付きのオプションはKawasakiへ連絡ください、◆付きのオプションはヨーロッパまたはアメリカでのみ利用可能です。"}]
[null,4,"セルの色が赤の場合､当社標準仕様範囲外となります｡ 当社仕様範囲外の場合でも､注記に詳細を記載頂き､当社までご相談ください｡","If the cell's color is red, the request is out of Kawasaki standard specification range. Even if the request is out of Kawasaki specification range, please describe the detail on the note and consult with Kawasaki.","如单元格颜色为红色时, 则超出本公司标准规格范围。即使是本公司规格范围外的情况, 也请在注释中详细记载, 并与本公司协商。",{"$f":"HLOOKUP(K3VLS!T1,C2:E173,4,FALSE)","v":"セルの色が赤の場合､当社標準仕様範囲外となります｡ 当社仕様範囲外の場合でも､注記に詳細を記載頂き､当社までご相談ください｡"}]
[null,5,"記入日 ：","Fill-in Date ：","填写日期 ：",{"$f":"HLOOKUP(K3VLS!T1,C2:E173,5,FALSE)","v":"記入日 ："}]
[null,6,"作成者 ：","Author ：","编制者 ：",{"$f":"HLOOKUP(K3VLS!T1,C2:E173,6,FALSE)","v":"作成者 ："}]
[null,7,"用途 ：","Application ：","用途 ：",{"$f":"HLOOKUP(K3VLS!T1,C2:E173,7,FALSE)","v":"用途 ："}]
[null,8,"実機型式 ：","Machine Model ：","整机型号 ：",{"$f":"HLOOKUP(K3VLS!T1,C2:E173,8,FALSE)","v":"実機型式 ："}]
[null,9,"顧客 ：","Customer ：","客户 ：",{"$f":"HLOOKUP(K3VLS!T1,C2:E173,9,FALSE)","v":"顧客 ："}]
[null,10,"ポンプ型式 ：","Pump Model ：","泵型号 ：",{"$f":"HLOOKUP(K3VLS!T1,C2:E173,10,FALSE)","v":"ポンプ型式 ："}]
[null,11,"斜板式アキシャルピストンポンプ","Swash Plate Type Axial Piston Pump","斜盘式轴向柱塞泵",{"$f":"HLOOKUP(K3VLS!T1,C2:E173,11,FALSE)","v":"斜板式アキシャルピストンポンプ"}]
[null,12,"注文コード","Model Code","订货代码",{"$f":"HLOOKUP(K3VLS!T1,C2:E173,12,FALSE)","v":"注文コード"}]
[null,13,{"$f":"\"全ての必須項目に入力がされていません。\"","v":"全ての必須項目に入力がされていません。"},{"$f":"\"All required fields are not filled in.\"","v":"All required fields are not filled in."},{"$f":"\"所有必须填写项目尚未填写。\"","v":"所有必须填写项目尚未填写。"},{"$f":"HLOOKUP(K3VLS!T1,C2:E173,13,FALSE)","v":"全ての必須項目に入力がされていません。"}]
[null,14,"項目","Items","项目",{"$f":"HLOOKUP(K3VLS!T1,C2:E173,14,FALSE)","v":"項目"}]
[null,15,"ポンプ最大押しのけ容積","Pump Max Displacement","泵最大排量",{"$f":"HLOOKUP(K3VLS!T1,C2:E173,15,FALSE)","v":"ポンプ最大押しのけ容積"}]
[null,16,"最高 / 自吸最高回転数","Max / Self Prime Speed","最高/自吸最高转速",{"$f":"HLOOKUP(K3VLS!T1,C2:E173,16,FALSE)","v":"最高 / 自吸最高回転数"}]
[null,17,"ピーク / 定格圧力","Peak / Rated Pressure","峰值/额定压力",{"$f":"HLOOKUP(K3VLS!T1,C2:E173,17,FALSE)","v":"ピーク / 定格圧力"}]
[null,18,"ロードセンシング差圧設定 / 公差","Set Pressure of Load Sensing Differential Pressure / Tolerance","负载传感压差的设定/公差",{"$f":"HLOOKUP(K3VLS!T1,C2:E173,18,FALSE)","v":"ロードセンシング差圧設定 / 公差"}]
[null,19,"カットオフ圧力設定 / 公差","Set Pressure of Cut-Off / Tolerance","截断压力的设定/公差",{"$f":"HLOOKUP(K3VLS!T1,C2:E173,19,FALSE)","v":"カットオフ圧力設定 / 公差"}]
[null,20,"吸入圧力 / 油温範囲","Suction Pressure / Temperature Range","吸入压力/油温范围",{"$f":"HLOOKUP(K3VLS!T1,C2:E173,20,FALSE)","v":"吸入圧力 / 油温範囲"}]
[null,21,"ポンプ / スルードライブ入力トルク","Pump / Through Drive Input Torque","泵/贯通式驱动的输入转矩",{"$f":"HLOOKUP(K3VLS!T1,C2:E173,21,FALSE)","v":"ポンプ / スルードライブ入力トルク"}]
[null,22,"許容ケーシング圧","Case Drain Pressure","容许壳体压",{"$f":"HLOOKUP(K3VLS!T1,C2:E173,22,FALSE)","v":"許容ケーシング圧"}]
[null,23,"油種 / 粘度の許容範囲","Oil Type / Oil Viscosity Range","油种/粘度的允许范围",{"$f":"HLOOKUP(K3VLS!T1,C2:E173,23,FALSE)","v":"油種 / 粘度の許容範囲"}]
[null,24,"銘板","Name Plate","铭牌",{"$f":"HLOOKUP(K3VLS!T1,C2:E173,24,FALSE)","v":"銘板"}]
[null,25,"塗装仕様","Paint","涂装规格",{"$f":"HLOOKUP(K3VLS!T1,C2:E173,25,FALSE)","v":"塗装仕様"}]
[null,26,"顧客部品番号","Customer Part Number","客户零部件编号",{"$f":"HLOOKUP(K3VLS!T1,C2:E173,26,FALSE)","v":"顧客部品番号"}]
[null,27,"試供要件","Proto Type Requirement","试供要求",{"$f":"HLOOKUP(K3VLS!T1,C2:E173,27,FALSE)","v":"試供要件"}]
[null,28,"量産スケジュール","Production Schedule","量产日程",{"$f":"HLOOKUP(K3VLS!T1,C2:E173,28,FALSE)","v":"量産スケジュール"}]
[null,29,"元ポンプ型式(競合)","Original Pump Model (Competitor)","原泵型号 (竞争)",{"$f":"HLOOKUP(K3VLS!T1,C2:E173,29,FALSE)","v":"元ポンプ型式(競合)"}]
[null,30,"No.","No.","No.",{"$f":"HLOOKUP(K3VLS!T1,C2:E173,30,FALSE)","v":"No."}]
[null,31,"標準仕様","Standard Specification","标准规格",{"$f":"HLOOKUP(K3VLS!T1,C2:E173,31,FALSE)","v":"標準仕様"}]
[null,32,{"$f":"spec!X22","v":"50, 45, 40, 35cm3"},{"$f":"spec!X22","v":"50, 45, 40, 35cm3"},{"$f":"spec!X22","v":"50, 45, 40, 35cm3"},{"$f":"HLOOKUP(K3VLS!T1,C2:E173,32,FALSE)","v":"50, 45, 40, 35cm3"}]
[null,33,{"$f":"\"最高回転数: \"&TEXT(spec!Z22,\"0\")&\" \"&\"min-1 まで\"","v":"最高回転数: 3250 min-1 まで"},{"$f":"\"Max: Up to \"&TEXT(spec!Z22,\"0\")&\" \"&\"min-1\"","v":"Max: Up to 3250 min-1"},{"$f":"\"最高转速: 到\"&TEXT(spec!Z22,\"0\")&\" \"&\"min-1 为止\"","v":"最高转速: 到3250 min-1 为止"},{"$f":"HLOOKUP(K3VLS!T1,C2:E173,33,FALSE)","v":"最高回転数: 3250 min-1 まで"}]
[null,34,{"$f":"\"ピーク圧力: \"&TEXT(spec!AB22,\"0\")&\" \"&\"MPa まで\"","v":"ピーク圧力: 35 MPa まで"},{"$f":"\"Peak: Up to \"&TEXT(spec!AB22,\"0\")&\" \"&\"MPa\"","v":"Peak: Up to 35 MPa"},{"$f":"\"峰值压力: 到\"&TEXT(spec!AB22,\"0\")&\" \"&\"MPa 为止\"","v":"峰值压力: 到35 MPa 为止"},{"$f":"HLOOKUP(K3VLS!T1,C2:E173,34,FALSE)","v":"ピーク圧力: 35 MPa まで"}]
[null,35,{"$f":"\"ロードセンシング差圧設定: 1.5 MPa (標準)\"&CHAR(10)&IF(K3VLS!R74=\"A\",\"(コード A : 調整範囲 = 1.0 - 3.0 MPa)\",\"(コード C : 調整範囲 = 1.5 - 4.0 MPa)\")","v":"ロードセンシング差圧設定: 1.5 MPa (標準)\n(コード A : 調整範囲 = 1.0 - 3.0 MPa)"},{"$f":"\"Load Sensing Differential Pressure: 1.5 MPa (STD)\"&CHAR(10)&IF(K3VLS!R74=\"A\",\"(Code A : Adjustable Range = 1.0 - 3.0 MPa)\",\"(Code C : Adjustable Range = 1.5 - 4.0 MPa)\")","v":"Load Sensing Differential Pressure: 1.5 MPa (STD)\n(Code A : Adjustable Range = 1.0 - 3.0 MPa)"},{"$f":"\"负载传感压差设定: 1.5 MPa (标准)\"&CHAR(10)&IF(K3VLS!R74=\"A\",\"(代码A : 调整范围 = 1.0 - 3.0 MPa)\",\"(代码C : 调整范围 = 1.5 - 4.0 MPa)\")","v":"负载传感压差设定: 1.5 MPa (标准)\n(代码A : 调整范围 = 1.0 - 3.0 MPa)"},{"$f":"HLOOKUP(K3VLS!T1,C2:E173,35,FALSE)","v":"ロードセンシング差圧設定: 1.5 MPa (標準)\n(コード A : 調整範囲 = 1.0 - 3.0 MPa)"}]
[null,36,{"$f":"\"圧力カットオフ: 28 MPa (標準)\"&CHAR(10)&\"(調整範囲 = 5.0 - 28.0 MPa)\"","v":"圧力カットオフ: 28 MPa (標準)\n(調整範囲 = 5.0 - 28.0 MPa)"},{"$f":"\"Pressure Cut-Off: 28 MPa (STD)\"&CHAR(10)&\"(Adjustable Range = 5.0 - 28.0 MPa)\"","v":"Pressure Cut-Off: 28 MPa (STD)\n(Adjustable Range = 5.0 - 28.0 MPa)"},{"$f":"\"压力截断: 28 MPa (标准)\"&CHAR(10)&\"(调整范围 = 5.0 - 28.0 MPa)\"","v":"压力截断: 28 MPa (标准)\n(调整范围 = 5.0 - 28.0 MPa)"},{"$f":"HLOOKUP(K3VLS!T1,C2:E173,36,FALSE)","v":"圧力カットオフ: 28 MPa (標準)\n(調整範囲 = 5.0 - 28.0 MPa)"}]
[null,37,"吸入圧力は最大押しのけ容積で0MPa以上を保持してください。","The suction pressure has to be greater or equal to 0 MPa gauge at Maximum displacement.","吸入压力在最大排量时, 请保持0MPa以上。",{"$f":"HLOOKUP(K3VLS!T1,C2:E173,37,FALSE)","v":"吸入圧力は最大押しのけ容積で0MPa以上を保持してください。"}]
[null,38,{"$f":"\"ポンプ(スルードライブポンプを含む) トルク: \"&\" \"&TEXT(spec!R104,\"0\")&\" \"&\"Nm まで\"&\"\"","v":"ポンプ(スルードライブポンプを含む) トルク:  200 Nm まで"},{"$f":"\"Pump(Containing T/D Pump) Torque: Up to\"&\" \"&TEXT(spec!R104,\"0\")&\" \"&\"Nm\"&\"\"","v":"Pump(Containing T/D Pump) Torque: Up to 200 Nm"},{"$f":"\"泵(包括贯通式驱动的泵)转矩: 到\"&\" \"&TEXT(spec!R104,\"0\")&\" \"&\"Nm 为止\"&\"\"","v":"泵(包括贯通式驱动的泵)转矩: 到 200 Nm 为止"},{"$f":"HLOOKUP(K3VLS!T1,C2:E173,38,FALSE)","v":"ポンプ(スルードライブポンプを含む) トルク:  200 Nm まで"}]
[null,39,"常用: 0.1 MPaまで","Continuous: Up to 0.1 MPa","常用：到 0.1 MPa为止",{"$f":"HLOOKUP(K3VLS!T1,C2:E173,39,FALSE)","v":"常用: 0.1 MPaまで"}]
{"$rows_left_out":133}