{"text_format":"1","workbook":"xlsx","n_sheets":13,"sheets":["M7V","M7X","M7VC","M7V-spec","M7X-spec","M7VC-spec","REG_V","REG_VC","graph","Com","Notes","translation_V","translation_X"],"not_rendered":{"charts":2,"images":25,"macros":1,"external_links":0,"defined_names":35,"comments":1,"pivot_tables":0},"unopened":[],"bounds":{"document_bytes":16777216,"sheet_cells":100000,"rows_first":2000,"rows_last":500,"rows_between":2000,"halvings":0,"cell_chars":16384,"cell_head_chars":4096},"cells_cut":0,"cells_raw":0,"read":"whole","date_system":"1900"}

{"sheet":"M7V","index":0,"n_rows":107,"n_cols":36,"rows_kept":107,"cut":false,"hidden":false,"merged":[[65,1,69,4],[102,31,103,35],[104,31,104,35],[72,31,74,35],[82,34,84,35],[92,34,94,35],[80,34,80,35],[90,34,90,35],[88,34,88,35],[77,31,84,33],[87,31,94,33],[78,34,78,35],[95,31,99,35],[95,27,95,28],[96,27,96,28],[97,27,97,28],[70,31,71,35],[100,31,101,35],[75,32,76,35],[75,31,76,31],[85,31,86,31],[85,32,86,35],[95,1,99,4],[95,5,99,6],[0,32,0,33],[36,7,36,28],[11,21,11,22],[19,29,19,30],[20,29,20,35],[36,29,36,30],[41,29,41,30],[36,31,36,35],[8,21,8,28],[5,17,5,20],[40,27,40,28],[5,21,5,24],[5,25,5,28],[12,23,12,24],[38,27,38,28],[39,27,39,28],[14,7,14,28],[17,18,17,28],[37,31,40,35],[11,9,11,10],[11,27,11,28],[12,27,12,28],[16,7,16,10],[12,15,12,16],[61,31,62,35],[54,31,60,35],[49,18,49,26],[42,29,50,30],[53,18,53,26],[51,7,51,17],[51,18,51,28],[52,27,52,28],[54,29,62,30],[64,27,64,28],[62,27,62,28],[61,27,61,28],[37,29,40,30],[52,7,52,17],[53,7,53,17],[15,18,15,28],[24,7,24,28],[25,7,25,28],[56,7,56,26],[56,27,56,28],[2,1,2,6],[5,1,6,14],[7,1,8,14],[11,33,12,35],[27,29,27,35],[54,7,54,26],[55,7,55,26],[55,27,55,28],[53,27,53,28],[21,29,21,32],[18,18,18,28],[2,32,2,35],[5,32,5,35],[8,32,8,35],[15,7,15,17],[48,8,48,17],[49,8,49,17],[22,29,22,35],[26,29,26,30],[26,7,26,28],[23,7,23,28],[54,27,54,28],[2,29,2,31],[5,29,5,31],[105,27,105,28],[70,29,84,30],[100,29,104,30],[82,27,82,28],[83,27,83,28],[102,27,102,28],[58,27,58,28],[57,7,57,26],[106,27,106,28],[72,7,73,7],[61,7,61,26],[57,27,57,28],[82,8,84,12],[74,8,77,12],[63,29,63,30],[64,29,64,30],[63,27,63,28],[60,27,60,28],[72,8,73,12],[73,27,73,28],[65,27,65,28],[65,7,65,26],[75,27,75,28],[76,27,76,28],[105,31,105,35],[106,31,106,35],[70,27,70,28],[71,27,71,28],[52,18,52,26],[21,33,21,34],[103,7,103,26],[66,27,66,28],[98,27,98,28],[99,27,99,28],[101,7,101,26],[103,27,103,28],[104,27,104,28],[47,8,47,17],[59,7,59,26],[48,18,48,26],[60,7,60,26],[105,29,105,30],[106,29,106,30],[84,27,84,28],[88,27,88,28],[85,27,85,28],[77,27,77,28],[78,27,78,28],[8,29,8,31],[2,17,2,20],[8,17,8,20],[2,21,2,28],[15,29,15,30],[12,29,12,30],[24,29,24,35],[25,29,25,30],[48,27,48,28],[43,27,44,28],[42,31,50,35],[41,31,41,35],[41,27,41,28],[22,7,22,28],[50,8,50,17],[50,27,50,28],[49,27,49,28],[54,5,62,6],[11,29,11,30],[11,25,11,26],[12,25,12,26],[14,29,14,35],[12,21,12,22],[12,9,12,10],[22,5,22,6],[21,5,21,6],[26,34,26,35],[25,34,25,35],[51,5,53,6],[51,31,53,35],[29,20,29,35],[30,20,34,35],[29,1,29,19],[51,29,53,30],[37,27,37,28],[62,7,62,26],[45,8,45,17],[47,27,47,28],[36,5,36,6],[27,5,27,6],[11,19,11,20],[105,1,105,4],[64,5,64,6],[63,5,63,6],[59,27,59,28],[105,5,105,6],[70,5,84,6],[105,7,105,26],[67,7,67,26],[82,7,84,7],[85,1,94,4],[100,1,104,4],[70,1,84,4],[98,23,99,26],[96,23,97,26],[95,23,95,26],[93,27,93,28],[94,27,94,28],[78,7,81,7],[100,27,100,28],[100,7,100,26],[74,27,74,28],[66,7,66,26],[86,27,86,28],[87,27,87,28],[106,1,106,4],[14,1,14,4],[15,1,15,4],[36,1,36,4],[37,1,40,4],[41,1,41,4],[42,1,50,4],[51,1,53,4],[54,1,62,4],[63,1,63,4],[64,1,64,4],[20,1,20,4],[16,1,16,4],[17,1,17,4],[18,1,18,4],[19,1,19,4],[30,1,34,19],[106,7,106,26],[106,5,106,6],[15,5,15,6],[14,5,14,6],[16,11,16,17],[58,7,58,26],[27,1,27,4],[23,1,23,4],[24,1,24,4],[25,1,25,4],[26,1,26,4],[26,5,26,6],[25,5,25,6],[11,3,11,4],[12,3,12,4],[11,17,11,18],[11,11,11,12],[11,13,11,14],[11,1,12,1],[21,1,21,4],[22,1,22,4],[20,5,20,6],[19,5,19,6],[16,18,16,21],[12,7,12,8],[18,7,18,17],[17,7,17,17],[11,7,11,8],[12,11,12,12],[21,7,21,17],[21,18,21,28],[65,31,69,35],[85,5,94,6],[67,27,67,28],[37,5,40,6],[42,5,50,6],[41,5,41,6],[43,18,44,26],[43,7,44,7],[46,8,46,17],[45,7,46,7],[45,18,46,26],[44,8,44,17],[42,7,42,17],[47,18,47,26],[37,7,37,26],[38,7,38,26],[39,7,39,26],[40,7,40,26],[41,7,41,26],[63,31,63,35],[64,31,64,35],[89,27,89,28],[90,27,90,28],[72,27,72,28],[85,29,94,30],[91,27,91,28],[0,15,0,25],[102,7,102,26],[101,27,101,28],[95,29,99,30],[96,19,96,22],[97,19,97,22],[98,19,99,22],[97,7,97,18],[96,7,96,18],[65,29,69,30],[70,8,71,12],[70,7,71,7],[74,7,77,7],[42,18,42,28],[43,8,43,17],[45,27,46,28],[50,18,50,26],[16,29,16,30],[17,29,17,30],[18,29,18,30],[27,7,27,28],[23,29,23,35],[65,5,69,6],[68,7,68,26],[69,7,69,26],[68,27,68,28],[69,27,69,28],[100,5,104,6],[104,7,104,26],[95,7,95,18],[95,19,95,22],[92,27,92,28],[78,8,81,12],[79,27,79,28],[80,27,80,28],[81,27,81,28],[24,5,24,6],[23,5,23,6],[19,7,19,28],[20,7,20,28],[16,22,16,28],[16,5,16,6],[12,5,12,6],[11,5,11,6],[12,13,12,14],[12,17,12,18],[12,19,12,20],[11,15,11,16],[11,23,11,24],[18,5,18,6],[17,5,17,6]]}
[null,null,null,null,null,null,null,null,null,null,null,null,null,null,null,{"$f":"VLOOKUP(M7V!V6,'M7V-spec'!AQ8:AR13,2,0)","v":{"$error":"#N/A"}},null,null,null,null,null,null,null,null,null,null,null,null,null,null,null,null,"言語 : 日本語",null,null,"Rev: 7"]
[]
[null,{"$f":"translation_V!G3","v":"M7V シリーズ 引合仕様書"},null,null,null,null,null,null,null,null,null,null,null,null,null,null,null,{"$f":"translation_V!G6","v":"記入日 ："},null,null,null,null,null,null,null,null,null,null,null,{"$f":"translation_V!G7","v":"作成者 ："}]
[]
[]
[null,{"$f":"translation_V!G4","v":"赤枠のセルのドロップダウンリストからアイテムを選択してください。★付きのオプションは開発中であり、選択されたらセルが黄色になります。"},null,null,null,null,null,null,null,null,null,null,null,null,null,null,null,{"$f":"translation_V!G8","v":"用途 ："},null,null,null,null,null,null,null,null,null,null,null,{"$f":"translation_V!G9","v":"実機型式 ："}]
{"$rows_left_out":102}
{"sheet":"M7X","index":1,"n_rows":97,"n_cols":36,"rows_kept":97,"cut":false,"hidden":false,"merged":[[84,19,84,23],[83,19,83,23],[86,19,87,23],[87,27,87,28],[82,29,87,30],[82,31,87,35],[83,8,83,18],[84,8,84,18],[85,8,85,18],[86,27,86,28],[82,7,82,18],[11,23,11,24],[5,25,5,28],[2,1,2,6],[5,1,6,14],[7,1,8,14],[11,1,12,1],[11,3,11,4],[11,5,11,6],[11,7,11,8],[11,9,11,10],[11,11,11,12],[12,3,12,4],[12,5,12,6],[12,7,12,8],[12,9,12,10],[11,13,11,14],[12,11,12,12],[12,13,12,14],[8,21,8,28],[12,23,12,24],[11,15,11,16],[0,32,0,33],[2,17,2,20],[2,21,2,28],[2,29,2,31],[2,32,2,35],[5,17,5,20],[5,29,5,31],[5,32,5,35],[8,17,8,20],[0,15,0,25],[5,21,5,24],[8,32,8,35],[61,1,61,4],[61,5,61,6],[61,7,61,28],[18,29,18,30],[16,29,16,30],[15,7,15,28],[8,29,8,31],[12,17,12,18],[11,17,11,18],[11,19,11,20],[11,21,11,22],[11,25,11,26],[12,19,12,20],[12,21,12,22],[12,25,12,26],[61,31,61,35],[12,15,12,16],[61,29,61,30],[14,1,14,4],[14,5,14,6],[14,7,14,28],[18,7,18,17],[11,33,12,35],[18,18,18,28],[21,33,21,34],[23,29,23,35],[14,29,14,35],[15,1,15,4],[15,5,15,6],[15,29,15,30],[16,1,16,4],[16,5,16,6],[25,5,25,6],[15,31,15,34],[16,31,16,34],[22,1,22,4],[22,5,22,6],[22,7,22,28],[23,1,23,4],[23,5,23,6],[23,7,23,28],[16,7,16,28],[62,1,64,4],[62,5,64,6],[62,7,62,26],[62,27,62,28],[65,1,65,4],[69,27,69,28],[70,8,70,17],[70,18,70,26],[70,27,70,28],[63,7,63,26],[63,27,63,28],[65,27,65,28],[68,18,68,26],[68,27,68,28],[65,5,65,6],[65,7,65,26],[81,1,81,4],[66,1,70,4],[66,5,70,6],[66,7,66,17],[66,18,66,28],[67,8,67,17],[67,18,67,26],[67,27,67,28],[68,8,68,17],[74,1,80,4],[74,5,80,6],[71,1,73,4],[72,18,72,26],[73,18,73,26],[78,7,78,26],[74,27,74,28],[75,7,75,26],[75,27,75,28],[76,7,76,26],[76,27,76,28],[77,7,77,26],[77,27,77,28],[78,27,78,28],[72,7,72,17],[96,29,96,30],[85,27,85,28],[83,27,83,28],[88,1,90,4],[88,5,90,6],[89,7,89,26],[90,7,90,26],[89,27,89,28],[88,27,88,28],[92,7,92,26],[92,27,92,28],[93,7,93,26],[93,27,93,28],[91,7,91,26],[91,27,91,28],[91,1,95,4],[91,5,95,6],[96,1,96,4],[96,5,96,6],[96,7,96,26],[96,27,96,28],[83,24,85,26],[86,24,87,26],[85,19,85,23],[96,31,96,35],[17,1,17,4],[17,5,17,6],[17,7,17,17],[17,18,17,28],[17,29,17,30],[19,1,19,4],[19,5,19,6],[19,7,19,28],[19,29,19,30],[20,1,20,4],[20,5,20,6],[20,7,20,28],[20,29,20,35],[18,1,18,4],[18,5,18,6],[21,1,21,4],[21,5,21,6],[21,7,21,17],[21,18,21,28],[21,29,21,32],[65,29,65,30],[71,7,71,17],[71,18,71,28],[30,1,59,19],[30,20,59,35],[24,1,24,4],[24,5,24,6],[24,7,24,28],[24,29,24,35],[25,1,25,4],[29,20,29,35],[26,7,26,28],[26,29,26,30],[26,34,26,35],[27,1,27,4],[27,5,27,6],[29,1,29,19],[25,34,25,35],[25,7,25,28],[25,29,25,30],[94,7,94,26],[95,7,95,26],[94,27,94,28],[95,27,95,28],[74,7,74,26],[74,31,75,35],[69,8,69,17],[69,18,69,26],[26,5,26,6],[81,5,81,6],[81,27,81,28],[64,7,64,26],[64,27,64,28],[62,29,64,30],[66,29,70,30],[66,31,70,35],[65,31,65,35],[62,31,64,35],[73,27,73,28],[71,29,73,30],[88,31,89,35],[90,31,90,35],[82,24,82,26],[82,19,82,23],[91,29,95,30],[74,29,80,30],[71,5,73,6],[76,31,80,35],[27,7,27,28],[27,29,27,35],[22,29,22,35],[26,1,26,4],[82,1,87,4],[82,5,87,6],[91,31,95,35],[88,29,90,30],[90,27,90,28],[88,7,88,26],[81,31,81,35],[71,31,73,35],[72,27,72,28],[73,7,73,17],[84,27,84,28],[81,29,81,30],[79,7,79,26],[79,27,79,28],[80,7,80,26],[80,27,80,28]]}
[null,null,null,null,null,null,null,null,null,null,null,null,null,null,null,{"$f":"VLOOKUP(M7X!V6,'M7X-spec'!AC8:AD13,2,0)","v":{"$error":"#N/A"}},null,null,null,null,null,null,null,null,null,null,null,null,null,null,null,null,"言語 : 日本語",null,null,"Rev: 7"]
[]
[null,{"$f":"translation_X!G3","v":"M7X シリーズ 引合仕様書"},null,null,null,null,null,null,null,null,null,null,null,null,null,null,null,{"$f":"translation_X!G6","v":"記入日 ："},null,null,null,null,null,null,null,null,null,null,null,{"$f":"translation_X!G7","v":"作成者 ："}]
[]
[]
[null,{"$f":"translation_X!G4","v":"赤枠のセルのドロップダウンリストからアイテムを選択してください。★付きのオプションは開発中であり、選択されたらセルが黄色になります。"},null,null,null,null,null,null,null,null,null,null,null,null,null,null,null,{"$f":"translation_X!G8","v":"用途 ："},null,null,null,null,null,null,null,null,null,null,null,{"$f":"translation_X!G9","v":"実機型式 ："}]
{"$rows_left_out":92}
{"sheet":"M7VC","index":2,"n_rows":104,"n_cols":36,"rows_kept":104,"cut":false,"hidden":true,"merged":[[66,7,66,26],[67,7,67,26],[66,27,66,28],[67,27,67,28],[85,5,94,6],[85,1,94,4],[91,7,91,26],[92,7,92,26],[93,7,93,26],[94,7,94,26],[84,27,84,28],[78,13,78,26],[88,7,88,26],[88,27,88,28],[85,7,85,26],[85,27,85,28],[86,7,86,26],[86,27,86,28],[87,7,87,26],[87,27,87,28],[93,27,93,28],[94,27,94,28],[89,7,89,26],[90,7,90,26],[103,31,103,35],[102,1,102,4],[102,5,102,6],[102,7,102,26],[102,27,102,28],[102,29,102,30],[102,31,102,35],[99,31,99,35],[100,7,100,26],[100,27,100,28],[100,31,101,35],[101,7,101,26],[101,27,101,28],[99,1,101,4],[99,5,101,6],[99,7,99,26],[99,27,99,28],[99,29,101,30],[103,1,103,4],[103,5,103,6],[103,7,103,26],[103,27,103,28],[103,29,103,30],[89,27,89,28],[90,27,90,28],[95,1,98,4],[95,5,98,6],[96,27,96,28],[97,7,97,11],[97,12,97,16],[97,17,97,26],[97,27,97,28],[95,7,95,11],[95,12,95,16],[95,17,95,26],[96,7,96,11],[96,12,96,16],[96,17,96,26],[91,27,91,28],[92,27,92,28],[97,31,98,35],[98,7,98,11],[98,12,98,16],[98,17,98,26],[98,27,98,28],[72,27,72,28],[95,31,96,35],[81,27,81,28],[82,7,84,7],[82,8,84,12],[82,13,82,26],[83,13,83,26],[83,27,83,28],[84,13,84,26],[72,7,73,7],[72,8,73,12],[73,13,73,26],[73,27,73,28],[74,8,77,12],[74,13,74,26],[95,29,98,30],[95,27,95,28],[70,31,76,35],[85,29,94,30],[59,31,60,35],[56,31,58,35],[78,27,78,28],[79,13,79,26],[79,27,79,28],[74,27,74,28],[75,13,75,26],[75,27,75,28],[70,27,70,28],[70,29,84,30],[82,27,82,28],[64,29,64,30],[80,13,80,26],[80,27,80,28],[76,13,76,26],[76,27,76,28],[77,13,77,26],[77,27,77,28],[65,29,69,30],[65,31,69,35],[70,13,70,26],[72,13,72,26],[81,13,81,26],[68,7,68,26],[64,1,64,4],[64,5,64,6],[71,13,71,26],[71,27,71,28],[64,31,64,35],[65,7,65,26],[65,27,65,28],[62,7,62,26],[62,27,62,28],[70,1,84,4],[65,1,69,4],[64,27,64,28],[63,31,63,35],[61,31,62,35],[70,5,84,6],[70,7,71,7],[70,8,71,12],[78,7,81,7],[78,8,81,12],[65,5,69,6],[68,27,68,28],[69,7,69,26],[69,27,69,28],[74,7,77,7],[56,1,58,4],[56,5,58,6],[56,7,56,17],[56,18,56,28],[63,1,63,4],[63,5,63,6],[63,27,63,28],[63,29,63,30],[59,29,62,30],[60,7,60,26],[60,27,60,28],[56,29,58,30],[57,7,57,17],[57,18,57,26],[57,27,57,28],[58,7,58,17],[59,1,62,4],[59,5,62,6],[59,7,59,26],[59,27,59,28],[61,7,61,26],[61,27,61,28],[58,18,58,26],[58,27,58,28],[51,29,51,30],[51,31,51,35],[52,1,55,4],[52,5,55,6],[52,7,52,17],[52,18,52,28],[52,29,55,30],[52,31,55,35],[51,1,51,4],[51,5,51,6],[51,7,51,26],[51,27,51,28],[55,8,55,17],[55,18,55,26],[55,27,55,28],[53,8,53,17],[53,18,53,26],[53,27,53,28],[54,8,54,17],[54,18,54,26],[54,27,54,28],[50,1,50,4],[50,5,50,6],[50,7,50,26],[50,27,50,28],[50,29,50,30],[50,31,50,35],[29,1,29,19],[29,20,29,35],[30,1,47,19],[30,20,47,35],[49,1,49,4],[49,5,49,6],[49,7,49,28],[49,29,49,30],[49,31,49,35],[26,1,26,4],[26,5,26,6],[26,7,26,28],[26,29,26,30],[26,34,26,35],[27,1,27,4],[27,5,27,6],[27,7,27,28],[27,29,27,35],[24,1,24,4],[24,5,24,6],[24,7,24,28],[24,29,24,35],[25,1,25,4],[25,5,25,6],[25,7,25,28],[25,29,25,30],[25,34,25,35],[22,1,22,4],[22,5,22,6],[22,7,22,28],[22,29,22,35],[23,1,23,4],[23,5,23,6],[23,7,23,28],[23,29,23,35],[21,1,21,4],[21,5,21,6],[21,7,21,17],[21,18,21,28],[21,29,21,32],[21,33,21,34],[19,1,19,4],[19,5,19,6],[19,7,19,28],[19,29,19,30],[20,1,20,4],[20,5,20,6],[20,7,20,28],[20,29,20,35],[18,1,18,4],[18,5,18,6],[18,7,18,17],[18,18,18,28],[18,29,18,30],[16,22,16,28],[16,29,16,30],[17,1,17,4],[17,5,17,6],[17,7,17,17],[17,18,17,28],[17,29,17,30],[15,1,15,4],[15,5,15,6],[15,7,15,17],[15,18,15,28],[15,29,15,30],[16,1,16,4],[16,5,16,6],[16,7,16,10],[16,11,16,17],[16,18,16,21],[11,19,11,20],[11,21,11,22],[12,27,12,28],[12,29,12,30],[14,1,14,4],[14,5,14,6],[14,7,14,28],[14,29,14,35],[12,15,12,16],[12,17,12,18],[12,19,12,20],[12,21,12,22],[12,23,12,24],[12,25,12,26],[11,33,12,35],[7,1,8,14],[8,17,8,20],[8,21,8,28],[8,29,8,31],[8,32,8,35],[11,1,12,1],[11,3,11,4],[11,5,11,6],[11,7,11,8],[11,9,11,10],[11,23,11,24],[11,25,11,26],[11,27,11,28],[11,29,11,30],[12,3,12,4],[12,5,12,6],[12,7,12,8],[12,9,12,10],[12,11,12,12],[12,13,12,14],[11,11,11,12],[11,13,11,14],[11,15,11,16],[11,17,11,18],[5,1,6,14],[5,17,5,20],[5,21,5,24],[5,25,5,28],[5,29,5,31],[5,32,5,35],[0,17,0,28],[0,32,0,33],[2,1,2,6],[2,17,2,20],[2,21,2,28],[2,29,2,31],[2,32,2,35],[78,31,85,33],[87,31,94,33],[86,32,86,35],[77,32,77,35],[83,34,85,35],[79,34,79,35],[81,34,81,35],[92,34,94,35],[90,34,90,35],[88,34,88,35]]}
[null,null,null,null,null,null,null,null,null,null,null,null,null,null,null,null,null,{"$f":"VLOOKUP(M7VC!V6,'M7VC-spec'!AQ8:AR13,2,0)","v":" "},null,null,null,null,null,null,null,null,null,null,null,null,null,null,"Language : English",null,null,"Rev: 6"]
[]
[null,"M7VC series Inquiry Form",null,null,null,null,null,null,null,null,null,null,null,null,null,null,null,"Fill-in Date ：",null,null,null,null,null,null,null,null,null,null,null,"Author ："]
[]
[]
[null,"Please select an item from a drop down list in a cell with thick red borders. Options with ★ are under development. If it is chosen, the cell's color changes to yellow.",null,null,null,null,null,null,null,null,null,null,null,null,null,null,null,"Application ：",null,null,null,"General(Other)",null,null,null,null,null,null,null,"Machine Model ："]
{"$rows_left_out":99}
{"sheet":"M7V-spec","index":3,"n_rows":145,"n_cols":44,"rows_kept":145,"cut":false,"hidden":true,"merged":[[125,8,125,17],[128,3,129,4],[130,3,131,4],[132,3,135,4],[136,3,139,4],[140,3,142,4],[128,5,128,7],[135,5,135,7],[134,5,134,7],[133,5,133,7],[132,5,132,7],[131,5,131,7],[130,5,130,7],[129,5,129,7],[142,5,142,7],[141,5,141,7],[140,5,140,7],[139,5,139,7],[138,5,138,7],[137,5,137,7],[136,5,136,7],[120,1,120,2],[88,1,89,1],[88,3,89,7],[90,1,91,1],[90,3,91,7],[98,1,99,4],[100,5,107,7],[100,1,107,4],[97,5,97,7],[140,1,142,1],[136,1,139,1],[128,1,129,1],[132,1,135,1],[130,1,131,1],[5,20,5,21],[6,20,6,21],[15,1,15,2],[18,6,18,7],[18,10,18,11],[22,6,22,7],[22,10,22,11],[27,1,27,2],[27,10,27,11],[28,10,28,11],[23,6,23,7],[23,10,23,11],[24,6,24,7],[24,10,24,11],[97,8,97,18],[46,1,49,1],[67,1,68,1],[73,1,76,1],[77,1,79,1],[84,1,85,1],[52,1,55,1],[65,1,66,1],[65,3,66,7],[69,1,72,1],[69,3,72,7],[86,1,87,1],[86,3,87,7],[98,9,98,18],[19,6,19,7],[19,10,19,11],[20,6,20,7],[20,10,20,11],[21,6,21,7],[21,10,21,11],[67,3,68,7],[73,3,76,7],[77,3,79,7],[84,3,85,7],[29,10,29,11],[30,10,30,11],[31,10,31,11],[33,10,33,13],[97,1,97,4]]}
[]
["M7V Ordering Code"]
[]
[]
[null,"Please fill in the Inquiry Form on page 39 in order to specify the requirement."]
[null,null,null,1,null,2,3,4,5,6,null,7,8,9,10,11,12,13,14,null,15]
{"$rows_left_out":140}
{"sheet":"M7X-spec","index":4,"n_rows":87,"n_cols":30,"rows_kept":87,"cut":false,"hidden":true,"merged":[[79,2,79,3],[53,8,53,13],[53,5,53,7],[53,2,53,4],[16,2,16,3],[19,2,19,3],[28,2,28,3],[57,2,64,4],[57,5,64,7],[55,2,55,4],[56,2,56,4],[54,2,54,4],[54,5,56,7]]}
[]
[null,"M7X Ordering Code"]
[]
[]
[null,null,"Please fill in the Inquiry Form on page ** in order to specify the requirement."]
[]
{"$rows_left_out":82}
{"sheet":"M7VC-spec","index":5,"n_rows":132,"n_cols":44,"rows_kept":132,"cut":false,"hidden":true,"merged":[[129,14,129,15],[129,16,129,17],[129,18,129,19],[129,20,129,21],[24,6,24,7],[24,10,24,11],[127,1,129,1],[127,3,129,6],[127,14,127,15],[127,16,127,17],[127,18,127,19],[127,20,127,21],[128,14,128,15],[128,16,128,17],[128,18,128,19],[128,20,128,21],[125,14,125,15],[125,16,125,17],[125,18,125,19],[125,20,125,21],[126,14,126,15],[126,16,126,17],[126,18,126,19],[126,20,126,21],[123,1,126,1],[123,3,126,6],[123,14,123,15],[123,16,123,17],[123,18,123,19],[123,20,123,21],[124,14,124,15],[124,16,124,17],[124,18,124,19],[124,20,124,21],[122,14,122,15],[122,16,122,17],[122,18,122,19],[122,20,122,21],[119,1,122,1],[119,3,122,6],[119,14,119,15],[119,16,119,17],[119,18,119,19],[119,20,119,21],[120,14,120,15],[120,16,120,17],[120,18,120,19],[120,20,120,21],[117,14,117,15],[117,16,117,17],[117,18,117,19],[117,20,117,21],[121,14,121,15],[121,16,121,17],[121,18,121,19],[121,20,121,21],[117,3,118,6],[118,14,118,15],[118,16,118,17],[118,18,118,19],[118,20,118,21],[116,14,116,15],[116,16,116,17],[116,18,116,19],[116,20,116,21],[73,1,76,1],[73,3,76,7],[77,1,79,1],[77,3,79,7],[84,1,85,1],[84,3,85,7],[114,1,114,13],[115,1,116,1],[115,3,116,6],[115,14,115,15],[115,16,115,17],[115,18,115,19],[107,1,107,2],[113,14,113,15],[113,16,113,17],[113,18,113,19],[86,1,87,1],[86,3,87,7],[67,3,68,7],[28,10,28,11],[29,10,29,11],[30,10,30,11],[31,10,31,11],[33,10,33,13],[46,1,49,1],[113,20,113,21],[115,20,115,21],[88,1,89,1],[88,3,89,7],[90,1,91,1],[90,3,91,7],[52,1,55,1],[65,1,66,1],[65,3,66,7],[69,1,72,1],[69,3,72,7],[67,1,68,1],[5,20,5,21],[6,20,6,21],[15,1,15,2],[18,6,18,7],[18,10,18,11],[23,10,23,11],[27,1,27,2],[27,10,27,11],[20,6,20,7],[20,10,20,11],[21,10,21,11],[22,10,22,11],[19,6,19,7],[19,10,19,11]]}
[]
["M7V Ordering Code"]
[]
[]
[null,"Please fill in the Inquiry Form on page 39 in order to specify the requirement."]
[null,null,null,1,null,2,3,4,5,6,null,7,8,9,10,11,12,13,14,null,15]
{"$rows_left_out":127}
{"sheet":"REG_V","index":6,"n_rows":42,"n_cols":7,"rows_kept":42,"cut":false,"hidden":true,"merged":[[0,1,2,1],[0,2,2,2],[0,5,2,5],[0,6,1,6],[0,3,0,4]]}
[null,"型式","タイプ","傾転補正値",null,"単位","備考"]
[null,null,null,1,2]
[null,null,null,"V/I/P","V/I/P"]
[null,"T1",{"$f":"translation_V!G133","v":" ネガティブ制御 （電圧=24V）"},24,24,"V [V]",{"$f":"translation_V!G180","v":"調整不可"}]
[null,"T2",{"$f":"translation_V!G134","v":" ネガティブ制御 （電圧=12V）"},12,12,"V [V]",{"$f":"translation_V!G180","v":"調整不可"}]
[null,"Y1",{"$f":"translation_V!G135","v":" ネガティブ制御"},1,1,"P [MPa]",{"$f":"translation_V!G180","v":"調整不可"}]
{"$rows_left_out":37}
{"sheet":"REG_VC","index":7,"n_rows":38,"n_cols":7,"rows_kept":38,"cut":false,"hidden":true,"merged":[[0,1,2,1],[0,2,2,2],[0,3,0,4],[0,5,2,5],[0,6,1,6]]}
[null,"型式","タイプ","傾転補正値",null,"単位","備考"]
[null,null,null,1,2]
[null,null,null,"V/I/P","V/I/P"]
[null,"T1",{"$f":"IF(M7V!AG1=\"Language : English\",\"Negative Control, 24V\",\"ネガティブ制御(電圧=24V)\")","v":"ネガティブ制御(電圧=24V)"},24,24,"V [V]",{"$f":"IF(M7V!AG1=\"Language : English\",\"Unadjustable\",\"調整不可\")","v":"調整不可"}]
[null,"T2",{"$f":"IF(M7V!AG1=\"Language : English\",\"Negative Control, 12V\",\"ネガティブ制御(電圧=12V)\")","v":"ネガティブ制御(電圧=12V)"},12,12,"V [V]",{"$f":"IF(M7V!AG1=\"Language : English\",\"Unadjustable\",\"調整不可\")","v":"調整不可"}]
[null,"Y1",{"$f":"IF(M7V!AG1=\"Language : English\",\"Negative Control\",\"ネガティブ制御\")","v":"ネガティブ制御"},1,1,"P [MPa]",{"$f":"IF(M7V!AG1=\"Language : English\",\"Unadjustable\",\"調整不可\")","v":"調整不可"}]
{"$rows_left_out":33}
{"sheet":"graph","index":8,"n_rows":26,"n_cols":3,"rows_kept":26,"cut":false,"hidden":true,"merged":[]}
[]
[null,"T1"]
[null,"T2"]
[null,"Y1"]
[null,"Y2"]
[null,"E1"]
{"$rows_left_out":21}
{"sheet":"Com","index":9,"n_rows":216,"n_cols":26,"rows_kept":216,"cut":false,"hidden":true,"merged":[]}
[null,"A",1,1,"A11","○",null,"A",1,2,"A12","○",null,"T1","X","T1X","○",null,"T1X",1,null,"C",1,2,"C12","○"]
[null,"A",1,2,"A12","○",null,"A",1,4,"A14","○",null,"T2","X","T2X","○",null,"T2X",1,null,"C",1,3,"C13","○"]
["SAE","A",1,3,"A13","○",null,"A",1,5,"A15","×",null,"Y1","X","Y1X","○",null,"Y1X",2,null,"C",1,7,"C17","×"]
["ISO","A",1,4,"A14","×",null,"A",1,6,"A16","×",null,"Y2","X","Y2X","○",null,"Y2X",null,null,"C",1,8,"C18","×"]
[null,"A",1,5,"A15","×",null,"A",1,7,"A17","×",null,"E1","X","E1X","○",null,"E1X",3,null,"C",4,2,"C42","×"]
[null,"A",1,6,"A16","×",null,"A",1,8,"A18","×",null,"E2","X","E2X","○",null,"E3X",3,null,"C",4,3,"C43","×"]
{"$rows_left_out":211}
{"sheet":"Notes","index":10,"n_rows":13,"n_cols":1,"rows_kept":13,"cut":false,"hidden":true,"merged":[]}
["Notes:"]
[]
["1)  Select an option from the drop down list from top-to-bottom, beginning with the motor size."]
[]
["2)   A requirement displayed with gray shading means that it is not available."]
[]
{"$rows_left_out":8}
{"sheet":"translation_V","index":11,"n_rows":197,"n_cols":15,"rows_kept":197,"cut":false,"hidden":true,"merged":[]}
[]
[null,1,null,"Language : English","言語 : 日本語","語言 : 中文"]
[null,2,null,"M7V series Inquiry Form","M7V シリーズ 引合仕様書","M7V 系列 询价规格书",{"$f":"HLOOKUP(M7V!AG1,D2:F186,2,FALSE)","v":"M7V シリーズ 引合仕様書"}]
[null,3,null,"Please select an item from a drop down list in a cell with thick red borders. Options with ★ are under development. If it is chosen, the cell's color changes to yellow.","赤枠のセルのドロップダウンリストからアイテムを選択してください。★付きのオプションは開発中であり、選択されたらセルが黄色になります。","请从红框单元格的下拉列表中选择项目。带★中的选项为正开发中, 选中后单元格会变为黄色。",{"$f":"HLOOKUP(M7V!AG1,D2:F186,3,FALSE)","v":"赤枠のセルのドロップダウンリストからアイテムを選択してください。★付きのオプションは開発中であり、選択されたらセルが黄色になります。"}]
[null,4,null,"If the cell's color is red, the request is out of Kawasaki standard specification range. Even if the request is out of Kawasaki specification range, please describe the detail on the note and consult with Kawasaki.","セルの色が赤の場合、当社仕様範囲外となります。当社仕様範囲外の場合でも、注記に詳細を記載頂き、当社までご相談ください。","如单元格颜色为红色时, 则超出本公司标准规格范围。即使是本公司规格范围外的情况, 也请在注释中详细记载, 并与本公司协商。",{"$f":"HLOOKUP(M7V!AG1,D2:F186,4,FALSE)","v":"セルの色が赤の場合、当社仕様範囲外となります。当社仕様範囲外の場合でも、注記に詳細を記載頂き、当社までご相談ください。"}]
[null,5,null,"Fill-in Date ：","記入日 ：","填写日期 ：",{"$f":"HLOOKUP(M7V!AG1,D2:F186,5,FALSE)","v":"記入日 ："}]
{"$rows_left_out":192}
{"sheet":"translation_X","index":12,"n_rows":138,"n_cols":13,"rows_kept":138,"cut":false,"hidden":true,"merged":[]}
[]
[null,1,null,"Language : English","言語 : 日本語","語言 : 中文"]
[null,2,null,"M7X series Inquiry Form","M7X シリーズ 引合仕様書","M7X 系列 询价规格书",{"$f":"HLOOKUP(M7X!AG1,D2:F127,2,FALSE)","v":"M7X シリーズ 引合仕様書"}]
[null,3,null,"Please select an item from a drop down list in a cell with thick red borders. Options with ★ are under development. If it is chosen, the cell's color changes to yellow.","赤枠のセルのドロップダウンリストからアイテムを選択してください。★付きのオプションは開発中であり、選択されたらセルが黄色になります。","请从红框单元格的下拉列表中选择项目。带★中的选项为正开发中, 选中后单元格会变为黄色。",{"$f":"HLOOKUP(M7X!AG1,D2:F127,3,FALSE)","v":"赤枠のセルのドロップダウンリストからアイテムを選択してください。★付きのオプションは開発中であり、選択されたらセルが黄色になります。"}]
[null,4,null,"If the cell's color is red, the request is out of Kawasaki standard specification range. Even if the request is out of Kawasaki specification range, please describe the detail on the note and consult with Kawasaki.","セルの色が赤の場合、当社仕様範囲外となります。当社仕様範囲外の場合でも、注記に詳細を記載頂き、当社までご相談ください。","如单元格颜色为红色时, 则超出本公司规格范围。即使是本公司规格范围外的情况, 也请在注释中详细记载, 并与本公司协商。",{"$f":"HLOOKUP(M7X!AG1,D2:F127,4,FALSE)","v":"セルの色が赤の場合、当社仕様範囲外となります。当社仕様範囲外の場合でも、注記に詳細を記載頂き、当社までご相談ください。"}]
[null,5,null,"Fill-in Date ：","記入日 ：","填写日期 ：",{"$f":"HLOOKUP(M7X!AG1,D2:F127,5,FALSE)","v":"記入日 ："}]
{"$rows_left_out":132}